Mock Version: 2.12 Mock Version: 2.12 Mock Version: 2.12 ENTER ['do_with_status'](['bash', '--login', '-c', '/usr/bin/rpmbuild -bs --target noarch --nodeps /builddir/build/SPECS/log4j.spec'], chrootPath='/var/lib/mock/dist-an7-build-32226-15943/root'env={'TERM': 'vt100', 'SHELL': '/bin/bash', 'HOME': '/builddir', 'HOSTNAME': 'mock', 'PATH': '/usr/bin:/bin:/usr/sbin:/sbin', 'PROMPT_COMMAND': 'printf "\\033]0;\\007"', 'PS1': ' \\s-\\v\\$ ', 'LANG': 'C.UTF-8'}shell=Falselogger=timeout=86400uid=989gid=135user='mockbuild'nspawn_args=['--capability=cap_ipc_lock', '--bind=/tmp/mock-resolv.ynqh7ujs:/etc/resolv.conf', '--bind=/dev/loop-control', '--bind=/dev/loop0', '--bind=/dev/loop1', '--bind=/dev/loop2', '--bind=/dev/loop3', '--bind=/dev/loop4', '--bind=/dev/loop5', '--bind=/dev/loop6', '--bind=/dev/loop7', '--bind=/dev/loop8', '--bind=/dev/loop9', '--bind=/dev/loop10', '--bind=/dev/loop11']unshare_net=TrueprintOutput=False) Using nspawn with args ['--capability=cap_ipc_lock', '--bind=/tmp/mock-resolv.ynqh7ujs:/etc/resolv.conf', '--bind=/dev/loop-control', '--bind=/dev/loop0', '--bind=/dev/loop1', '--bind=/dev/loop2', '--bind=/dev/loop3', '--bind=/dev/loop4', '--bind=/dev/loop5', '--bind=/dev/loop6', '--bind=/dev/loop7', '--bind=/dev/loop8', '--bind=/dev/loop9', '--bind=/dev/loop10', '--bind=/dev/loop11'] Executing command: ['/usr/bin/systemd-nspawn', '-q', '-M', '1784e1f154144d2e900e21a4d2da9401', '-D', '/var/lib/mock/dist-an7-build-32226-15943/root', '-a', '-u', 'mockbuild', '--capability=cap_ipc_lock', '--bind=/tmp/mock-resolv.ynqh7ujs:/etc/resolv.conf', '--bind=/dev/loop-control', '--bind=/dev/loop0', '--bind=/dev/loop1', '--bind=/dev/loop2', '--bind=/dev/loop3', '--bind=/dev/loop4', '--bind=/dev/loop5', '--bind=/dev/loop6', '--bind=/dev/loop7', '--bind=/dev/loop8', '--bind=/dev/loop9', '--bind=/dev/loop10', '--bind=/dev/loop11', '--setenv=TERM=vt100', '--setenv=SHELL=/bin/bash', '--setenv=HOME=/builddir', '--setenv=HOSTNAME=mock', '--setenv=PATH=/usr/bin:/bin:/usr/sbin:/sbin', '--setenv=PROMPT_COMMAND=printf "\\033]0;\\007"', '--setenv=PS1= \\s-\\v\\$ ', '--setenv=LANG=C.UTF-8', '--resolv-conf=off', 'bash', '--login', '-c', '/usr/bin/rpmbuild -bs --target noarch --nodeps /builddir/build/SPECS/log4j.spec'] with env {'TERM': 'vt100', 'SHELL': '/bin/bash', 'HOME': '/builddir', 'HOSTNAME': 'mock', 'PATH': '/usr/bin:/bin:/usr/sbin:/sbin', 'PROMPT_COMMAND': 'printf "\\033]0;\\007"', 'PS1': ' \\s-\\v\\$ ', 'LANG': 'C.UTF-8', 'SYSTEMD_NSPAWN_TMPFS_TMP': '0'} and shell False Building target platforms: noarch Building for target noarch Wrote: /builddir/build/SRPMS/log4j-1.2.17-16.an7.src.rpm Child return code was: 0 ENTER ['do_with_status'](['bash', '--login', '-c', '/usr/bin/rpmbuild -bb --target noarch --nodeps /builddir/build/SPECS/log4j.spec'], chrootPath='/var/lib/mock/dist-an7-build-32226-15943/root'env={'TERM': 'vt100', 'SHELL': '/bin/bash', 'HOME': '/builddir', 'HOSTNAME': 'mock', 'PATH': '/usr/bin:/bin:/usr/sbin:/sbin', 'PROMPT_COMMAND': 'printf "\\033]0;\\007"', 'PS1': ' \\s-\\v\\$ ', 'LANG': 'C.UTF-8'}shell=Falselogger=timeout=86400uid=989gid=135user='mockbuild'nspawn_args=['--capability=cap_ipc_lock', '--bind=/tmp/mock-resolv.ynqh7ujs:/etc/resolv.conf', '--bind=/dev/loop-control', '--bind=/dev/loop0', '--bind=/dev/loop1', '--bind=/dev/loop2', '--bind=/dev/loop3', '--bind=/dev/loop4', '--bind=/dev/loop5', '--bind=/dev/loop6', '--bind=/dev/loop7', '--bind=/dev/loop8', '--bind=/dev/loop9', '--bind=/dev/loop10', '--bind=/dev/loop11']unshare_net=TrueprintOutput=False) Using nspawn with args ['--capability=cap_ipc_lock', '--bind=/tmp/mock-resolv.ynqh7ujs:/etc/resolv.conf', '--bind=/dev/loop-control', '--bind=/dev/loop0', '--bind=/dev/loop1', '--bind=/dev/loop2', '--bind=/dev/loop3', '--bind=/dev/loop4', '--bind=/dev/loop5', '--bind=/dev/loop6', '--bind=/dev/loop7', '--bind=/dev/loop8', '--bind=/dev/loop9', '--bind=/dev/loop10', '--bind=/dev/loop11'] Executing command: ['/usr/bin/systemd-nspawn', '-q', '-M', '28b8ce21b1d043b4841c7bf4c2bf6176', '-D', '/var/lib/mock/dist-an7-build-32226-15943/root', '-a', '-u', 'mockbuild', '--capability=cap_ipc_lock', '--bind=/tmp/mock-resolv.ynqh7ujs:/etc/resolv.conf', '--bind=/dev/loop-control', '--bind=/dev/loop0', '--bind=/dev/loop1', '--bind=/dev/loop2', '--bind=/dev/loop3', '--bind=/dev/loop4', '--bind=/dev/loop5', '--bind=/dev/loop6', '--bind=/dev/loop7', '--bind=/dev/loop8', '--bind=/dev/loop9', '--bind=/dev/loop10', '--bind=/dev/loop11', '--setenv=TERM=vt100', '--setenv=SHELL=/bin/bash', '--setenv=HOME=/builddir', '--setenv=HOSTNAME=mock', '--setenv=PATH=/usr/bin:/bin:/usr/sbin:/sbin', '--setenv=PROMPT_COMMAND=printf "\\033]0;\\007"', '--setenv=PS1= \\s-\\v\\$ ', '--setenv=LANG=C.UTF-8', '--resolv-conf=off', 'bash', '--login', '-c', '/usr/bin/rpmbuild -bb --target noarch --nodeps /builddir/build/SPECS/log4j.spec'] with env {'TERM': 'vt100', 'SHELL': '/bin/bash', 'HOME': '/builddir', 'HOSTNAME': 'mock', 'PATH': '/usr/bin:/bin:/usr/sbin:/sbin', 'PROMPT_COMMAND': 'printf "\\033]0;\\007"', 'PS1': ' \\s-\\v\\$ ', 'LANG': 'C.UTF-8', 'SYSTEMD_NSPAWN_TMPFS_TMP': '0'} and shell False Building target platforms: noarch Building for target noarch Executing(%prep): /bin/sh -e /var/tmp/rpm-tmp.UD8X5P + umask 022 + cd /builddir/build/BUILD + cd /builddir/build/BUILD + rm -rf apache-log4j-1.2.17 + /usr/bin/gzip -dc /builddir/build/SOURCES/log4j-1.2.17.tar.gz + /usr/bin/tar -xf - + STATUS=0 + '[' 0 -ne 0 ']' + cd apache-log4j-1.2.17 + /usr/bin/chmod -Rf a+rX,u+w,g-w,o-w . + echo 'Patch #0 (0001-logfactor5-changed-userdir.patch):' Patch #0 (0001-logfactor5-changed-userdir.patch): + /usr/bin/cat /builddir/build/SOURCES/0001-logfactor5-changed-userdir.patch + /usr/bin/patch -p1 -b --suffix .logfactor-home --fuzz=0 patching file src/main/java/org/apache/log4j/lf5/viewer/configure/ConfigurationManager.java patching file src/main/java/org/apache/log4j/lf5/viewer/configure/MRUFileManager.java + echo 'Patch #1 (0006-Remove-mvn-clirr-plugin.patch):' Patch #1 (0006-Remove-mvn-clirr-plugin.patch): + /usr/bin/cat /builddir/build/SOURCES/0006-Remove-mvn-clirr-plugin.patch + /usr/bin/patch -p1 -b --suffix .remove-mvn-clirr --fuzz=0 patching file pom.xml Hunk #1 succeeded at 394 (offset 44 lines). + echo 'Patch #2 (0009-Fix-tests.patch):' Patch #2 (0009-Fix-tests.patch): + /usr/bin/cat /builddir/build/SOURCES/0009-Fix-tests.patch + /usr/bin/patch -p1 -b --suffix .fix-tests --fuzz=0 patching file tests/build.xml + echo 'Patch #3 (0010-Fix-javadoc-link.patch):' Patch #3 (0010-Fix-javadoc-link.patch): + /usr/bin/cat /builddir/build/SOURCES/0010-Fix-javadoc-link.patch + /usr/bin/patch -p1 -b --suffix .xlink-javadoc --fuzz=0 patching file build.xml + echo 'Patch #4 (0011-Remove-openejb.patch):' Patch #4 (0011-Remove-openejb.patch): + /usr/bin/cat /builddir/build/SOURCES/0011-Remove-openejb.patch + /usr/bin/patch -p1 -b --suffix .openejb --fuzz=0 patching file pom.xml Hunk #1 succeeded at 529 (offset 1 line). + echo 'Patch #5 (0012-Add-proper-bundle-symbolicname.patch):' Patch #5 (0012-Add-proper-bundle-symbolicname.patch): + /usr/bin/cat /builddir/build/SOURCES/0012-Add-proper-bundle-symbolicname.patch + /usr/bin/patch -p1 -b --suffix .bundlename --fuzz=0 patching file pom.xml Hunk #1 succeeded at 421 (offset 1 line). + echo 'Patch #6 (0001-Backport-fix-for-CVE-2017-5645.patch):' Patch #6 (0001-Backport-fix-for-CVE-2017-5645.patch): + /usr/bin/cat /builddir/build/SOURCES/0001-Backport-fix-for-CVE-2017-5645.patch + /usr/bin/patch -p1 -b --suffix .cve-2017-5645 --fuzz=0 patching file src/main/java/org/apache/log4j/FilteredObjectInputStream.java patching file src/main/java/org/apache/log4j/net/SocketNode.java + . /usr/share/java-utils/pom_editor.sh + pom_remove_plugin :maven-site-plugin + set +x + sed -i 's|groupId>ant<|groupId>org.apache.ant<|g' pom.xml + sed -i 's/\r//g' LICENSE NOTICE site/css/maven-base.css site/css/maven-theme.css site/css/site.css site/xref/stylesheet.css site/xref-test/stylesheet.css + for i in 'contribs/JimMoore/mail*' + iconv --from=ISO-8859-1 --to=UTF-8 contribs/JimMoore/mail-2001-03-12T1326 + mv new contribs/JimMoore/mail-2001-03-12T1326 + for i in 'contribs/JimMoore/mail*' + iconv --from=ISO-8859-1 --to=UTF-8 contribs/JimMoore/mail-2001-03-12T1454 + mv new contribs/JimMoore/mail-2001-03-12T1454 + for i in 'contribs/JimMoore/mail*' + iconv --from=ISO-8859-1 --to=UTF-8 contribs/JimMoore/mail-2001-03-13T0646 + mv new contribs/JimMoore/mail-2001-03-13T0646 + find -name '*.jar' -o -name '*.class' -delete + rm -rf docs/api + mkdir -p tests/lib/ + cd tests/lib/ ++ build-classpath jakarta-oro + ln -s /usr/share/java/jakarta-oro.jar ++ build-classpath javamail/mail + ln -s /usr/share/java/javamail/mail.jar ++ build-classpath junit + ln -s /usr/share/java/junit.jar + exit 0 Executing(%build): /bin/sh -e /var/tmp/rpm-tmp.upwIpk + umask 022 + cd /builddir/build/BUILD + cd apache-log4j-1.2.17 + python /usr/share/java-utils/mvn_file.py : log4j + python /usr/share/java-utils/mvn_build.py -n log4j [INFO] Scanning for projects... [WARNING] [WARNING] Some problems were encountered while building the effective model for log4j:log4j:bundle:1.2.17 [WARNING] 'build.plugins.plugin.version' for org.apache.maven.plugins:maven-resources-plugin is missing. @ line 89, column 15 [WARNING] [WARNING] It is highly recommended to fix these problems because they threaten the stability of your build. [WARNING] [WARNING] For this reason, future Maven versions might no longer support building such malformed projects. [WARNING] [INFO] [INFO] ------------------------------------------------------------------------ [INFO] Building Apache Log4j 1.2.17 [INFO] ------------------------------------------------------------------------ [INFO] [INFO] --- maven-antrun-plugin:1.7:run (javadoc.resources) @ log4j --- [WARNING] Parameter tasks is deprecated, use target instead [INFO] Executing tasks main: [copy] Copying 2 files to /builddir/build/BUILD/apache-log4j-1.2.17/target/apidocs/META-INF [INFO] Executed tasks [INFO] [INFO] --- maven-resources-plugin:2.6:resources (default-resources) @ log4j --- [INFO] Using 'UTF-8' encoding to copy filtered resources. [INFO] Copying 7 resources [INFO] [INFO] --- maven-compiler-plugin:3.1:compile (default-compile) @ log4j --- [INFO] Changes detected - recompiling the module! [INFO] Compiling 214 source files to /builddir/build/BUILD/apache-log4j-1.2.17/target/classes [WARNING] /builddir/build/BUILD/apache-log4j-1.2.17/src/main/java/org/apache/log4j/chainsaw/MyTableModel.java: Some input files use or override a deprecated API. [WARNING] /builddir/build/BUILD/apache-log4j-1.2.17/src/main/java/org/apache/log4j/chainsaw/MyTableModel.java: Recompile with -Xlint:deprecation for details. [WARNING] /builddir/build/BUILD/apache-log4j-1.2.17/src/main/java/org/apache/log4j/spi/LoggingEvent.java: Some input files use unchecked or unsafe operations. [WARNING] /builddir/build/BUILD/apache-log4j-1.2.17/src/main/java/org/apache/log4j/spi/LoggingEvent.java: Recompile with -Xlint:unchecked for details. [INFO] [INFO] --- maven-antrun-plugin:1.7:run (ntdll) @ log4j --- [WARNING] Parameter tasks is deprecated, use target instead [INFO] Executing tasks main: windres: [mkdir] Created dir: /builddir/build/BUILD/apache-log4j-1.2.17/target/obj [exec] Execute failed: java.io.IOException: Cannot run program "i586-mingw32msvc-windres" (in directory "/builddir/build/BUILD/apache-log4j-1.2.17/src/ntdll"): error=2, No such file or directory compile: windres-echo: [echo] i586-mingw32msvc-windres could not be found or failed, NTEventLogAppender.dll build skipped. jni_md.h-echo: [echo] ${env.JNI_WIN32_INCLUDE_DIR}/jni_md.h not found, NTEventLogAppender.dll build skipped. build: [INFO] Executed tasks [INFO] [INFO] --- maven-resources-plugin:2.6:testResources (default-testResources) @ log4j --- [INFO] Using 'UTF-8' encoding to copy filtered resources. [INFO] Copying 12 resources [INFO] [INFO] --- maven-compiler-plugin:3.1:testCompile (default-testCompile) @ log4j --- [INFO] Changes detected - recompiling the module! [INFO] Compiling 90 source files to /builddir/build/BUILD/apache-log4j-1.2.17/target/test-classes [WARNING] /builddir/build/BUILD/apache-log4j-1.2.17/tests/src/java/org/apache/log4j/LogCapture.java: Some input files use or override a deprecated API. [WARNING] /builddir/build/BUILD/apache-log4j-1.2.17/tests/src/java/org/apache/log4j/LogCapture.java: Recompile with -Xlint:deprecation for details. [WARNING] /builddir/build/BUILD/apache-log4j-1.2.17/tests/src/java/org/apache/log4j/pattern/PatternParserTest.java: Some input files use unchecked or unsafe operations. [WARNING] /builddir/build/BUILD/apache-log4j-1.2.17/tests/src/java/org/apache/log4j/pattern/PatternParserTest.java: Recompile with -Xlint:unchecked for details. [INFO] [INFO] --- maven-antrun-plugin:1.7:run (mkdir_tests_output) @ log4j --- [WARNING] Parameter tasks is deprecated, use target instead [INFO] Executing tasks main: [mkdir] Created dir: /builddir/build/BUILD/apache-log4j-1.2.17/tests/output [INFO] Executed tasks [INFO] [INFO] --- maven-surefire-plugin:2.15:test (default-test) @ log4j --- [INFO] Tests are skipped. [INFO] [INFO] --- maven-antrun-plugin:1.7:run (runAll) @ log4j --- [WARNING] Parameter tasks is deprecated, use target instead [INFO] Executing tasks main: parentBuild: prepare: [available] DEPRECATED - used to override an existing property. [available] Build file should not reuse the same property name for different values. [mkdir] Created dir: /builddir/build/BUILD/apache-log4j-1.2.17/tests/classes build: [javac] /builddir/build/BUILD/apache-log4j-1.2.17/tests/build.xml:144: warning: 'includeantruntime' was not set, defaulting to build.sysclasspath=last; set to false for repeatable builds [javac] Compiling 90 source files to /builddir/build/BUILD/apache-log4j-1.2.17/tests/classes warning: [options] bootstrap class path not set in conjunction with -source 1.3 warning: [options] source value 1.3 is obsolete and will be removed in a future release warning: [options] target value 1.1 is obsolete and will be removed in a future release warning: [options] To suppress warnings about obsolete options, use -Xlint:-options. Note: Some input files use or override a deprecated API. Note: Recompile with -Xlint:deprecation for details. Core: [junit] Running org.apache.log4j.CoreTestSuite [junit] Testsuite: org.apache.log4j.CoreTestSuite [junit] Tests run: 503, Failures: 0, Errors: 0, Skipped: 0, Time elapsed: 26.413 sec [junit] Tests run: 503, Failures: 0, Errors: 0, Skipped: 0, Time elapsed: 26.413 sec [junit] ------------- Standard Output --------------- [junit] ?., ?.?. 03, 08:00:00.000 CST [junit] ?., ?.?. 03, 08:00:00.000 CST [junit] ?., ?.?. 03, 08:00:00.000 CST [junit] ?., ?.?. 03, 08:00:00.000 CST [junit] ?., ?.?. 03, 08:00:00.008 CST [junit] ?., ?.?. 03, 08:00:00.008 CST [junit] ------------- ---------------- --------------- [junit] ------------- Standard Error ----------------- [junit] log4j:ERROR Could not read configuration file [output/badescape.properties]. [junit] java.lang.IllegalArgumentException: Malformed \uxxxx encoding. [junit] at java.util.Properties.loadConvert(Properties.java:574) [junit] at java.util.Properties.load0(Properties.java:391) [junit] at java.util.Properties.load(Properties.java:341) [junit] at org.apache.log4j.PropertyConfigurator.doConfigure(PropertyConfigurator.java:373) [junit] at org.apache.log4j.PropertyConfigurator.configure(PropertyConfigurator.java:403) [junit] at org.apache.log4j.PropertyConfiguratorTest.testBadUnicodeEscape(PropertyConfiguratorTest.java:58) [junit] at sun.reflect.NativeMethodAccessorImpl.invoke0(Native Method) [junit] at sun.reflect.NativeMethodAccessorImpl.invoke(NativeMethodAccessorImpl.java:62) [junit] at sun.reflect.DelegatingMethodAccessorImpl.invoke(DelegatingMethodAccessorImpl.java:43) [junit] at java.lang.reflect.Method.invoke(Method.java:498) [junit] at junit.framework.TestCase.runTest(TestCase.java:176) [junit] at junit.framework.TestCase.runBare(TestCase.java:141) [junit] at junit.framework.TestResult$1.protect(TestResult.java:122) [junit] at junit.framework.TestResult.runProtected(TestResult.java:142) [junit] at junit.framework.TestResult.run(TestResult.java:125) [junit] at junit.framework.TestCase.run(TestCase.java:129) [junit] at junit.framework.TestSuite.runTest(TestSuite.java:255) [junit] at junit.framework.TestSuite.run(TestSuite.java:250) [junit] at junit.framework.TestSuite.runTest(TestSuite.java:255) [junit] at junit.framework.TestSuite.run(TestSuite.java:250) [junit] at org.apache.tools.ant.taskdefs.optional.junit.JUnitTestRunner.run(JUnitTestRunner.java:532) [junit] at org.apache.tools.ant.taskdefs.optional.junit.JUnitTestRunner.launch(JUnitTestRunner.java:1179) [junit] at org.apache.tools.ant.taskdefs.optional.junit.JUnitTestRunner.main(JUnitTestRunner.java:1030) [junit] log4j:ERROR Ignoring configuration file [output/badescape.properties]. [junit] log4j:ERROR Could not read configuration file from URL [file:/builddir/build/BUILD/apache-log4j-1.2.17/tests/output/urlbadescape.properties]. [junit] java.lang.IllegalArgumentException: Malformed \uxxxx encoding. [junit] at java.util.Properties.loadConvert(Properties.java:574) [junit] at java.util.Properties.load0(Properties.java:391) [junit] at java.util.Properties.load(Properties.java:341) [junit] at org.apache.log4j.PropertyConfigurator.doConfigure(PropertyConfigurator.java:558) [junit] at org.apache.log4j.PropertyConfigurator.configure(PropertyConfigurator.java:415) [junit] at org.apache.log4j.PropertyConfiguratorTest.testURLBadEscape(PropertyConfiguratorTest.java:92) [junit] at sun.reflect.NativeMethodAccessorImpl.invoke0(Native Method) [junit] at sun.reflect.NativeMethodAccessorImpl.invoke(NativeMethodAccessorImpl.java:62) [junit] at sun.reflect.DelegatingMethodAccessorImpl.invoke(DelegatingMethodAccessorImpl.java:43) [junit] at java.lang.reflect.Method.invoke(Method.java:498) [junit] at junit.framework.TestCase.runTest(TestCase.java:176) [junit] at junit.framework.TestCase.runBare(TestCase.java:141) [junit] at junit.framework.TestResult$1.protect(TestResult.java:122) [junit] at junit.framework.TestResult.runProtected(TestResult.java:142) [junit] at junit.framework.TestResult.run(TestResult.java:125) [junit] at junit.framework.TestCase.run(TestCase.java:129) [junit] at junit.framework.TestSuite.runTest(TestSuite.java:255) [junit] at junit.framework.TestSuite.run(TestSuite.java:250) [junit] at junit.framework.TestSuite.runTest(TestSuite.java:255) [junit] at junit.framework.TestSuite.run(TestSuite.java:250) [junit] at org.apache.tools.ant.taskdefs.optional.junit.JUnitTestRunner.run(JUnitTestRunner.java:532) [junit] at org.apache.tools.ant.taskdefs.optional.junit.JUnitTestRunner.launch(JUnitTestRunner.java:1179) [junit] at org.apache.tools.ant.taskdefs.optional.junit.JUnitTestRunner.main(JUnitTestRunner.java:1030) [junit] log4j:ERROR Ignoring configuration file [file:/builddir/build/BUILD/apache-log4j-1.2.17/tests/output/urlbadescape.properties]. [junit] log4j:ERROR Unrecognized format specifier [bogus] [junit] log4j:ERROR Unrecognized conversion specifier [bogus] starting at position 6 in conversion pattern. [junit] log4j:ERROR Unrecognized format specifier [] [junit] log4j:ERROR Empty conversion specifier starting at position 2 in conversion pattern. [junit] log4j:ERROR Unrecognized format specifier [] [junit] log4j:ERROR Empty conversion specifier starting at position 6 in conversion pattern. [junit] ------------- ---------------- --------------- [junit] [junit] Testcase: testLocationInfoNoFQCN took 0.001 sec [junit] Testcase: testSerializationMDC took 0.005 sec [junit] Testcase: testSerializationNDC took 0.001 sec [junit] Testcase: testBadMessage took 0 sec [junit] Testcase: testLevel took 0 sec [junit] Testcase: testSerializationWithException took 0.009 sec [junit] Testcase: testDeserializationWithException took 0.035 sec [junit] Testcase: testDeserializationSimple took 0 sec [junit] Testcase: testDeserializationWithLocation took 0 sec [junit] Testcase: testSerializationSimple took 0.001 sec [junit] Testcase: testFQNOfCategoryClass took 0 sec [junit] Testcase: testSerializationWithLocation took 0.001 sec [junit] Testcase: testSerializeINFO took 0 sec [junit] Testcase: testALL took 0 sec [junit] Testcase: testOFF took 0 sec [junit] Testcase: testDEBUG took 0 sec [junit] Testcase: testERROR took 0 sec [junit] Testcase: testFATAL took 0 sec [junit] Testcase: testTRACE took 0 sec [junit] Testcase: testTrace took 0 sec [junit] Testcase: testINFO took 0 sec [junit] Testcase: testWARN took 0 sec [junit] Testcase: testCustomLevelSerialization took 0.001 sec [junit] Testcase: testDottedLowerI took 0 sec [junit] Testcase: testIntToFatal took 0 sec [junit] Testcase: testIntToTrace took 0 sec [junit] Testcase: testDotlessLowerI took 0.001 sec [junit] Testcase: testSerialVersionUID took 0 sec [junit] Testcase: testLevelExtendsPriority took 0 sec [junit] Testcase: testStringToTrace took 0 sec [junit] Testcase: testIntToAll took 0 sec [junit] Testcase: testIntToOff took 0 sec [junit] Testcase: testToLevelNull took 0 sec [junit] Testcase: testToLevelUnrecognizedInt took 0 sec [junit] Testcase: testDeserializeINFO took 0.001 sec [junit] Testcase: testTraceInt took 0 sec [junit] Testcase: testToPriorityIntPriority took 0 sec [junit] Testcase: testToPriorityStringPriority took 0 sec [junit] Testcase: testEqualsLevel took 0 sec [junit] Testcase: testToPriorityString took 0.001 sec [junit] Testcase: testDEBUG took 0 sec [junit] Testcase: testERROR took 0 sec [junit] Testcase: testFatal took 0 sec [junit] Testcase: testINFO took 0 sec [junit] Testcase: testWARN took 0 sec [junit] Testcase: testDottedLowerI took 0 sec [junit] Testcase: testEqualsNull took 0 sec [junit] Testcase: testDotlessLowerI took 0 sec [junit] Testcase: testGetAllPossiblePriorities took 0 sec [junit] Testcase: testWarnInt took 0 sec [junit] Testcase: testAllInt took 0 sec [junit] Testcase: testDebugInt took 0 sec [junit] Testcase: testToPriorityInt took 0 sec [junit] Testcase: testInfoInt took 0 sec [junit] Testcase: testOffInt took 0 sec [junit] Testcase: testFatalInt took 0 sec [junit] Testcase: testErrorInt took 0 sec [junit] Testcase: testForcedLog took 0.101 sec [junit] Testcase: testSetPriority took 0 sec [junit] Testcase: testL7dlog4Param took 0 sec [junit] Testcase: testL7dlog took 0 sec [junit] Testcase: testGetChainedPriorityReturnType took 0 sec [junit] Testcase: testgetSetThreshold took 0 sec [junit] Testcase: testGetThresholdReturnType took 0 sec [junit] Testcase: testDirectoryCreation took 0.003 sec [junit] Testcase: testIsAsSevereAsThreshold took 0 sec [junit] Testcase: testConfiguratorClassKey took 0 sec [junit] Testcase: testDefaultConfigurationFile took 0 sec [junit] Testcase: testDefaultXmlConfigurationFile took 0 sec [junit] Testcase: testDefaultConfigurationKey took 0 sec [junit] Testcase: testDefaultInitOverrideKey took 0 sec [junit] Testcase: testConfigDebugKey took 0 sec [junit] Testcase: testDebugKey took 0 sec [junit] Testcase: testLineSepLen took 0 sec [junit] Testcase: testLineSep took 0 sec [junit] Testcase: testIgnoresThrowable took 0 sec [junit] Testcase: testGetFooter took 0 sec [junit] Testcase: testGetHeader took 0 sec [junit] Testcase: testFormat took 0 sec [junit] Testcase: testGetContentType took 0 sec [junit] Testcase: testSetDateFormatWithFormat took 0.004 sec [junit] Testcase: testISO8601Format took 0 sec [junit] Testcase: testSetDateFormatNullString took 0 sec [junit] Testcase: testSetDateFormatNull took 0 sec [junit] Testcase: testRelativeTimeDateFormat took 0 sec [junit] Testcase: testSetDateFormat took 0 sec [junit] Testcase: testGetOptionStrings took 0 sec [junit] Testcase: testDateFormatOption took 0 sec [junit] Testcase: testSetTimeZone took 0 sec [junit] Testcase: testSetDateFormatAbsolute took 0 sec [junit] Testcase: testSetDateFormatDateTime took 0 sec [junit] Testcase: testSetDateFormatSimple took 0 sec [junit] Testcase: testSetOptionDateFormat took 0 sec [junit] Testcase: testActivateOptions took 0 sec [junit] Testcase: testDateTimeFormat took 0.001 sec [junit] Testcase: testTimeZoneOption took 0 sec [junit] Testcase: testSetOptionTimeZone took 0 sec [junit] Testcase: testNullDateFormat took 0 sec [junit] Testcase: testSetDateFormatRelative took 0 sec [junit] Testcase: testSetDateFormatISO8601 took 0 sec [junit] Testcase: testLineSepLen took 0 sec [junit] Testcase: testLineSep took 0 sec [junit] Testcase: testIgnoresThrowable took 0 sec [junit] Testcase: testGetFooter took 0 sec [junit] Testcase: testGetHeader took 0 sec [junit] Testcase: testFormat took 0 sec [junit] Testcase: testGetContentType took 0 sec [junit] Testcase: testGetSetCategoryPrefixing took 0.001 sec [junit] Testcase: testGetSetContextPrinting took 0 sec [junit] Testcase: testFormat took 0 sec [junit] Testcase: testGetSetThreadPrinting took 0 sec [junit] Testcase: testSetDateFormatWithFormat took 0 sec [junit] Testcase: testISO8601Format took 0 sec [junit] Testcase: testSetDateFormatNullString took 0 sec [junit] Testcase: testSetDateFormatNull took 0 sec [junit] Testcase: testRelativeTimeDateFormat took 0 sec [junit] Testcase: testSetDateFormat took 0 sec [junit] Testcase: testGetOptionStrings took 0 sec [junit] Testcase: testDateFormatOption took 0 sec [junit] Testcase: testSetTimeZone took 0 sec [junit] Testcase: testSetDateFormatAbsolute took 0 sec [junit] Testcase: testSetDateFormatDateTime took 0 sec [junit] Testcase: testSetDateFormatSimple took 0 sec [junit] Testcase: testSetOptionDateFormat took 0 sec [junit] Testcase: testActivateOptions took 0 sec [junit] Testcase: testDateTimeFormat took 0 sec [junit] Testcase: testTimeZoneOption took 0 sec [junit] Testcase: testSetOptionTimeZone took 0 sec [junit] Testcase: testNullDateFormat took 0 sec [junit] Testcase: testSetDateFormatRelative took 0 sec [junit] Testcase: testSetDateFormatISO8601 took 0 sec [junit] Testcase: testLineSepLen took 0 sec [junit] Testcase: testLineSep took 0 sec [junit] Testcase: testIgnoresThrowable took 0 sec [junit] Testcase: testGetFooter took 0 sec [junit] Testcase: testGetHeader took 0 sec [junit] Testcase: testGetContentType took 0 sec [junit] Testcase: testNDCWithCDATA took 0.018 sec [junit] Testcase: testFormatWithException took 0.002 sec [junit] Testcase: testExceptionWithCDATA took 0.001 sec [junit] Testcase: testActivateOptions took 0 sec [junit] Testcase: testGetSetLocationInfo took 0 sec [junit] Testcase: testFormatWithNDC took 0.001 sec [junit] Testcase: testFormat took 0.001 sec [junit] Testcase: testProblemCharacters took 0.001 sec [junit] Testcase: testLineSepLen took 0 sec [junit] Testcase: testLineSep took 0 sec [junit] Testcase: testIgnoresThrowable took 0 sec [junit] Testcase: testGetFooter took 0 sec [junit] Testcase: testGetHeader took 0 sec [junit] Testcase: testGetContentType took 0 sec [junit] Testcase: testGetSetTitle took 0 sec [junit] Testcase: testFormatResize took 0.001 sec [junit] Testcase: testGetHeaderWithLocation took 0.002 sec [junit] Testcase: testActivateOptions took 0 sec [junit] Testcase: testGetSetLocationInfo took 0 sec [junit] Testcase: testGetFooter took 0 sec [junit] Testcase: testGetHeader took 0 sec [junit] Testcase: testFormat took 0.002 sec [junit] Testcase: testProblemCharacters took 0.004 sec [junit] Testcase: testLineSepLen took 0 sec [junit] Testcase: testLineSep took 0 sec [junit] Testcase: testIgnoresThrowable took 0 sec [junit] Testcase: testGetContentType took 0 sec [junit] Testcase: testFormatResize took 0 sec [junit] Testcase: testGetPatternFormat took 0 sec [junit] Testcase: testDefaultConversionPattern took 0 sec [junit] Testcase: testFormat took 0 sec [junit] Testcase: testTTCCConversionPattern took 0 sec [junit] Testcase: testLineSepLen took 0 sec [junit] Testcase: testLineSep took 0 sec [junit] Testcase: testIgnoresThrowable took 0 sec [junit] Testcase: testGetFooter took 0 sec [junit] Testcase: testGetHeader took 0 sec [junit] Testcase: testGetContentType took 0 sec [junit] Testcase: testLocationInfoNoFQCN took 0 sec [junit] Testcase: testSerializationMDC took 0 sec [junit] Testcase: testSerializationNDC took 0 sec [junit] Testcase: testBadMessage took 0 sec [junit] Testcase: testLevel took 0 sec [junit] Testcase: testSerializationWithException took 0.001 sec [junit] Testcase: testDeserializationWithException took 0.001 sec [junit] Testcase: testDeserializationSimple took 0 sec [junit] Testcase: testDeserializationWithLocation took 0 sec [junit] Testcase: testSerializationSimple took 0.001 sec [junit] Testcase: testFQNOfCategoryClass took 0 sec [junit] Testcase: testSerializationWithLocation took 0.001 sec [junit] Testcase: testLineFeedBlank took 0 sec [junit] Testcase: testEmpty took 0 sec [junit] Testcase: testParsing took 0 sec [junit] Testcase: testNull took 0 sec [junit] Testcase: testCarriageReturn took 0.001 sec [junit] Testcase: testGetThrowable took 0 sec [junit] Testcase: testNotOverriddenBehavior took 0.001 sec [junit] Testcase: testOverriddenBehavior took 0 sec [junit] Testcase: testIsolation took 0 sec [junit] Testcase: testNastyException took 0 sec [junit] Testcase: testLineFeed took 0 sec [junit] Testcase: testFourParamConstructor took 0 sec [junit] Testcase: testLocationInfo took 0 sec [junit] Testcase: testBadUnicodeEscape took 0.002 sec [junit] Testcase: testURL took 0.001 sec [junit] Testcase: testURLBadEscape took 0 sec [junit] Testcase: testReset took 0.001 sec [junit] Testcase: testInputStream took 0.014 sec [junit] Testcase: testThrowableRenderer took 0.001 sec [junit] Testcase: testJarURL took 0.002 sec [junit] Testcase: testNested took 0.001 sec [junit] Testcase: testTrigger took 0.035 sec [junit] Testcase: testIt took 1.404 sec [junit] Testcase: testDefaultRender took 0 sec [junit] Testcase: testEnhancedRender took 0.001 sec [junit] Testcase: testThrowing took 0.1 sec [junit] Testcase: testExiting took 0.1 sec [junit] Testcase: testEnteringNullNullNullArray took 0.1 sec [junit] Testcase: testExitingNullNullNull took 0.1 sec [junit] Testcase: testEntering took 0.1 sec [junit] Testcase: testExitingWithValue took 0.101 sec [junit] Testcase: testEnteringWithBadParam took 0.1 sec [junit] Testcase: testExitingNullNull took 0.1 sec [junit] Testcase: testEnteringWithBadParams took 0.1 sec [junit] Testcase: testThrowingNullNullNull took 0.101 sec [junit] Testcase: testExitingWithBadValue took 0.1 sec [junit] Testcase: testEnteringNullNullNull took 0.1 sec [junit] Testcase: testEnteringWithParam took 0.1 sec [junit] Testcase: testEnteringNullNull took 0.1 sec [junit] Testcase: testLogDouble took 0.103 sec [junit] Testcase: testWarnFourArg took 0.1 sec [junit] Testcase: testLogrbBoolean took 0.101 sec [junit] Testcase: testInfoDouble took 0.1 sec [junit] Testcase: testLogrbArrayArg took 0.1 sec [junit] Testcase: testLogThreeArg took 0.1 sec [junit] Testcase: testLogString took 0.1 sec [junit] Testcase: testLogTwoArg took 0.1 sec [junit] Testcase: testLogFloat took 0.1 sec [junit] Testcase: testLogNoArg took 0.1 sec [junit] Testcase: testLogShort took 0.1 sec [junit] Testcase: testLogrbMissingArg took 0.1 sec [junit] Testcase: testLogrbInt took 0.101 sec [junit] Testcase: testInfoString took 0.1 sec [junit] Testcase: testInfoTwoArg took 0.1 sec [junit] Testcase: testDebugArrayArg took 0.1 sec [junit] Testcase: testTraceNullArrayArg took 0.1 sec [junit] Testcase: testWarnBoolean took 0.1 sec [junit] Testcase: testTraceThreeArg took 0.101 sec [junit] Testcase: testInfoArrayArg took 0.1 sec [junit] Testcase: testWarnFloat took 0.1 sec [junit] Testcase: testDebugFullPrecisionAndPercent took 0.101 sec [junit] Testcase: testWarnNoArg took 0.1 sec [junit] Testcase: testWarnShort took 0.1 sec [junit] Testcase: testLogMissingArg took 0.1 sec [junit] Testcase: testInfo10ParamBrace9 took 0.1 sec [junit] Testcase: testTraceMissingArg took 0.1 sec [junit] Testcase: testTraceDouble took 0.1 sec [junit] Testcase: testLogrbByte took 0.1 sec [junit] Testcase: testLogrbChar took 0.1 sec [junit] Testcase: testLogrbLong took 0.1 sec [junit] Testcase: testLogrbNull took 0.101 sec [junit] Testcase: testInfoNullPattern took 0.1 sec [junit] Testcase: testDebugBadPattern took 0.1 sec [junit] Testcase: testTraceString took 0.1 sec [junit] Testcase: testInfoMissingArg took 0.1 sec [junit] Testcase: testTraceTwoArg took 0.1 sec [junit] Testcase: testWarnMissingArg took 0.1 sec [junit] Testcase: testLogArrayArg took 0.1 sec [junit] Testcase: testLogByte took 0.1 sec [junit] Testcase: testLogChar took 0.1 sec [junit] Testcase: testLogLong took 0.1 sec [junit] Testcase: testLogNull took 0.1 sec [junit] Testcase: testLogrbNullBundle took 0.1 sec [junit] Testcase: testWarnDouble took 0.1 sec [junit] Testcase: testTraceArrayArg took 0.1 sec [junit] Testcase: testLogrbNullKey took 0.101 sec [junit] Testcase: testTraceFloat took 0.1 sec [junit] Testcase: testTraceNoArg took 0.1 sec [junit] Testcase: testTraceShort took 0.1 sec [junit] Testcase: testWarnThreeArg took 0.1 sec [junit] Testcase: testLogNullPattern took 0.1 sec [junit] Testcase: testDebugByte took 0.1 sec [junit] Testcase: testDebugChar took 0.1 sec [junit] Testcase: testDebugDate took 0.101 sec [junit] Testcase: testDebugLong took 0.1 sec [junit] Testcase: testDebugNull took 0.1 sec [junit] Testcase: testLogrbBadPattern took 0.101 sec [junit] Testcase: testWarnString took 0.1 sec [junit] Testcase: testWarnTwoArg took 0.1 sec [junit] Testcase: testTraceFourArg took 0.1 sec [junit] Testcase: testClassName took 0.001 sec [junit] Testcase: testWarnInt took 0.1 sec [junit] Testcase: testLogrbFloat took 0.1 sec [junit] Testcase: testLogrbNoArg took 0.1 sec [junit] Testcase: testLogrbShort took 0.101 sec [junit] Testcase: testLogFourArg took 0.1 sec [junit] Testcase: testLogrbThreeArg took 0.1 sec [junit] Testcase: testInfoByte took 0.1 sec [junit] Testcase: testInfoChar took 0.1 sec [junit] Testcase: testInfoLong took 0.1 sec [junit] Testcase: testInfoNull took 0.1 sec [junit] Testcase: testLogrbDouble took 0.1 sec [junit] Testcase: testInfoFourArg took 0.1 sec [junit] Testcase: testInfo1ParamBrace9 took 0.1 sec [junit] Testcase: testLogBadPattern took 0.1 sec [junit] Testcase: testInfo2ParamBrace9 took 0.1 sec [junit] Testcase: testDebugNullArrayArg took 0.1 sec [junit] Testcase: testWarnByte took 0.101 sec [junit] Testcase: testWarnChar took 0.1 sec [junit] Testcase: testWarnLong took 0.1 sec [junit] Testcase: testWarnNull took 0.1 sec [junit] Testcase: testTraceBadPattern took 0.1 sec [junit] Testcase: testDebugPercent took 0.101 sec [junit] Testcase: testDebugFourArg took 0.1 sec [junit] Testcase: testDebugInt took 0.1 sec [junit] Testcase: testDebugThreeArg took 0.1 sec [junit] Testcase: testTraceBoolean took 0.1 sec [junit] Testcase: testTraceByte took 0.1 sec [junit] Testcase: testTraceChar took 0.1 sec [junit] Testcase: testTraceLong took 0.1 sec [junit] Testcase: testTraceNull took 0.1 sec [junit] Testcase: testLogrbString took 0.1 sec [junit] Testcase: testLogrbTwoArg took 0.1 sec [junit] Testcase: testDebugMissingArg took 0.101 sec [junit] Testcase: testInfoThreeArg took 0.1 sec [junit] Testcase: testLogInt took 0.1 sec [junit] Testcase: testLogrbFourArg took 0.1 sec [junit] Testcase: testInfoInt took 0.1 sec [junit] Testcase: testLogBoolean took 0.101 sec [junit] Testcase: testDebugDouble took 0.1 sec [junit] Testcase: testDebugFloat took 0.1 sec [junit] Testcase: testInfoBadPattern took 0.1 sec [junit] Testcase: testDebugNoArg took 0.101 sec [junit] Testcase: testInfoBoolean took 0.1 sec [junit] Testcase: testDebugShort took 0.1 sec [junit] Testcase: testWarnBadPattern took 0.1 sec [junit] Testcase: testWarnNullPattern took 0.1 sec [junit] Testcase: testTraceNullPattern took 0.1 sec [junit] Testcase: testInfoFloat took 0.1 sec [junit] Testcase: testInfoNoArg took 0.1 sec [junit] Testcase: testWarnArrayArg took 0.1 sec [junit] Testcase: testInfoShort took 0.1 sec [junit] Testcase: testTraceInt took 0.1 sec [junit] Testcase: testDebugBoolean took 0.1 sec [junit] Testcase: testDebugQuoted took 0.1 sec [junit] Testcase: testInfo1ParamBraceSlashColon took 0.1 sec [junit] Testcase: testDebugNullPattern took 0.1 sec [junit] Testcase: testDebugString took 0.101 sec [junit] Testcase: testDebugTwoArg took 0.1 sec [junit] Testcase: testLogDouble took 0.101 sec [junit] Testcase: testWarnFourArg took 0.1 sec [junit] Testcase: testLogrbBoolean took 0.101 sec [junit] Testcase: testInfoDouble took 0.101 sec [junit] Testcase: testLogrbArrayArg took 0.1 sec [junit] Testcase: testLogThreeArg took 0.1 sec [junit] Testcase: testLogString took 0.1 sec [junit] Testcase: testLogTwoArg took 0.1 sec [junit] Testcase: testLogFloat took 0.101 sec [junit] Testcase: testLogNoArg took 0.1 sec [junit] Testcase: testLogShort took 0.1 sec [junit] Testcase: testLogrbMissingArg took 0.1 sec [junit] Testcase: testLogrbInt took 0.1 sec [junit] Testcase: testInfoString took 0.1 sec [junit] Testcase: testInfoTwoArg took 0.1 sec [junit] Testcase: testDebugArrayArg took 0.1 sec [junit] Testcase: testTraceNullArrayArg took 0.1 sec [junit] Testcase: testWarnBoolean took 0.1 sec [junit] Testcase: testTraceThreeArg took 0.1 sec [junit] Testcase: testInfoArrayArg took 0.1 sec [junit] Testcase: testWarnFloat took 0.101 sec [junit] Testcase: testWarnNoArg took 0.1 sec [junit] Testcase: testWarnShort took 0.1 sec [junit] Testcase: testLogMissingArg took 0.1 sec [junit] Testcase: testTraceMissingArg took 0.1 sec [junit] Testcase: testTraceDouble took 0.1 sec [junit] Testcase: testLogrbByte took 0.101 sec [junit] Testcase: testLogrbChar took 0.1 sec [junit] Testcase: testLogrbLong took 0.1 sec [junit] Testcase: testLogrbNull took 0.1 sec [junit] Testcase: testInfoNullPattern took 0.1 sec [junit] Testcase: testDebugBadPattern took 0.1 sec [junit] Testcase: testTraceString took 0.1 sec [junit] Testcase: testInfoMissingArg took 0.1 sec [junit] Testcase: testTraceTwoArg took 0.1 sec [junit] Testcase: testWarnMissingArg took 0.1 sec [junit] Testcase: testLogArrayArg took 0.1 sec [junit] Testcase: testLogByte took 0.101 sec [junit] Testcase: testLogChar took 0.1 sec [junit] Testcase: testLogLong took 0.1 sec [junit] Testcase: testLogNull took 0.1 sec [junit] Testcase: testLogrbNullBundle took 0.1 sec [junit] Testcase: testWarnDouble took 0.1 sec [junit] Testcase: testTraceArrayArg took 0.1 sec [junit] Testcase: testLogrbNullKey took 0.1 sec [junit] Testcase: testTraceFloat took 0.1 sec [junit] Testcase: testTraceNoArg took 0.1 sec [junit] Testcase: testTraceShort took 0.1 sec [junit] Testcase: testWarnThreeArg took 0.101 sec [junit] Testcase: testLogNullPattern took 0.1 sec [junit] Testcase: testDebugByte took 0.1 sec [junit] Testcase: testDebugChar took 0.1 sec [junit] Testcase: testDebugLong took 0.1 sec [junit] Testcase: testDebugNull took 0.1 sec [junit] Testcase: testLogrbBadPattern took 0.101 sec [junit] Testcase: testWarnString took 0.1 sec [junit] Testcase: testWarnTwoArg took 0.1 sec [junit] Testcase: testTraceFourArg took 0.1 sec [junit] Testcase: testClassName took 0 sec [junit] Testcase: testEscapeTwoParam took 0.1 sec [junit] Testcase: testWarnInt took 0.1 sec [junit] Testcase: testLogrbFloat took 0.1 sec [junit] Testcase: testLogrbNoArg took 0.1 sec [junit] Testcase: testLogrbShort took 0.1 sec [junit] Testcase: testEscapeOneParam took 0.101 sec [junit] Testcase: testLogFourArg took 0.1 sec [junit] Testcase: testLogrbThreeArg took 0.1 sec [junit] Testcase: testInfoByte took 0.1 sec [junit] Testcase: testInfoChar took 0.1 sec [junit] Testcase: testInfoLong took 0.1 sec [junit] Testcase: testInfoNull took 0.101 sec [junit] Testcase: testLogrbDouble took 0.1 sec [junit] Testcase: testLogBadPattern took 0.1 sec [junit] Testcase: testDebugNullArrayArg took 0.1 sec [junit] Testcase: testWarnByte took 0.1 sec [junit] Testcase: testWarnChar took 0.1 sec [junit] Testcase: testWarnLong took 0.1 sec [junit] Testcase: testWarnNull took 0.1 sec [junit] Testcase: testTraceBadPattern took 0.1 sec [junit] Testcase: testDebugFourArg took 0.1 sec [junit] Testcase: testDebugInt took 0.1 sec [junit] Testcase: testDebugThreeArg took 0.1 sec [junit] Testcase: testTraceBoolean took 0.1 sec [junit] Testcase: testTraceByte took 0.1 sec [junit] Testcase: testTraceChar took 0.1 sec [junit] Testcase: testTraceLong took 0.1 sec [junit] Testcase: testTraceNull took 0.1 sec [junit] Testcase: testLogrbString took 0.1 sec [junit] Testcase: testLogrbTwoArg took 0.1 sec [junit] Testcase: testDebugMissingArg took 0.101 sec [junit] Testcase: testInfoThreeArg took 0.1 sec [junit] Testcase: testLogInt took 0.1 sec [junit] Testcase: testLogrbFourArg took 0.1 sec [junit] Testcase: testInfoInt took 0.1 sec [junit] Testcase: testLogBoolean took 0.1 sec [junit] Testcase: testDebugDouble took 0.1 sec [junit] Testcase: testDebugFloat took 0.1 sec [junit] Testcase: testInfoBadPattern took 0.1 sec [junit] Testcase: testDebugNoArg took 0.1 sec [junit] Testcase: testInfoBoolean took 0.1 sec [junit] Testcase: testDebugShort took 0.1 sec [junit] Testcase: testWarnBadPattern took 0.1 sec [junit] Testcase: testWarnNullPattern took 0.1 sec [junit] Testcase: testTraceNullPattern took 0.1 sec [junit] Testcase: testInfoFloat took 0.1 sec [junit] Testcase: testInfoNoArg took 0.1 sec [junit] Testcase: testWarnArrayArg took 0.1 sec [junit] Testcase: testInfoShort took 0.1 sec [junit] Testcase: testTraceInt took 0.1 sec [junit] Testcase: testDebugBoolean took 0.1 sec [junit] Testcase: testDebugNullPattern took 0.1 sec [junit] Testcase: testDebugString took 0.1 sec [junit] Testcase: testDebugTwoArg took 0.101 sec [junit] Testcase: test10 took 0 sec [junit] Testcase: test11 took 0 sec [junit] Testcase: test12 took 0 sec [junit] Testcase: test13 took 0 sec [junit] Testcase: test14 took 0 sec [junit] Testcase: test15 took 0 sec [junit] Testcase: test16 took 0 sec [junit] Testcase: test17 took 0.001 sec [junit] Testcase: test1 took 0 sec [junit] Testcase: test2 took 0 sec [junit] Testcase: test3 took 0 sec [junit] Testcase: test4 took 0.001 sec [junit] Testcase: test5 took 0.003 sec [junit] Testcase: test6 took 0 sec [junit] Testcase: test8 took 0 sec [junit] Testcase: test9 took 0.002 sec [junit] Testcase: testTruncate took 0 sec [junit] Testcase: testPadLeft took 0 sec [junit] Testcase: testPadRight took 0 sec [junit] Testcase: testGetDefault took 0 sec [junit] Testcase: testConstructor took 0 sec [junit] Testcase: testOne took 0.001 sec [junit] Testcase: testTwo took 0 sec [junit] Testcase: testBlank took 0 sec [junit] Testcase: testMulti took 0.001 sec [junit] Testcase: testZero took 0 sec [junit] Testcase: testMinusOne took 0 sec [junit] Testcase: testBlankOne took 0 sec [junit] Testcase: testOneDot took 0 sec [junit] Testcase: testOneTildeDot took 0 sec [junit] Testcase: testGetDefault took 0 sec [junit] Testcase: testBogus took 0.003 sec [junit] Testcase: testMore took 0 sec [junit] Testcase: testMultiOption took 0.001 sec [junit] Testcase: testFileNamePatternFactories took 0 sec [junit] Testcase: testMalformedOption took 0 sec [junit] Testcase: testBasic1 took 0 sec [junit] Testcase: testBasic2 took 0 sec [junit] Testcase: testNewWord took 0.001 sec [junit] Testcase: testBogusWord1 took 0 sec [junit] Testcase: testBogusWord2 took 0 sec [junit] Testcase: testPatternLayoutFactories took 0 sec [junit] Testcase: testNewWord2 took 0 sec [junit] Testcase: testToLevelFINEST took 0 sec Minimum: [junit] Running org.apache.log4j.MinimumTestCase [junit] Testsuite: org.apache.log4j.MinimumTestCase [junit] Tests run: 2, Failures: 0, Errors: 0, Skipped: 0, Time elapsed: 0.04 sec [junit] Tests run: 2, Failures: 0, Errors: 0, Skipped: 0, Time elapsed: 0.04 sec [junit] [junit] Testcase: simple took 0.022 sec [junit] Testcase: ttcc took 0.014 sec Logger: [junit] Running org.apache.log4j.LoggerTestCase [junit] Testsuite: org.apache.log4j.LoggerTestCase [junit] Tests run: 18, Failures: 0, Errors: 0, Skipped: 0, Time elapsed: 0.219 sec [junit] Tests run: 18, Failures: 0, Errors: 0, Skipped: 0, Time elapsed: 0.219 sec [junit] ------------- Standard Error ----------------- [junit] log4j:WARN No appenders could be found for logger (x). [junit] log4j:WARN Please initialize the log4j system properly. [junit] log4j:WARN See http://logging.apache.org/log4j/1.2/faq.html#noconfig for more info. [junit] ------------- ---------------- --------------- [junit] [junit] Testcase: testAppender1 took 0.008 sec [junit] Testcase: testAppender2 took 0 sec [junit] Testcase: testTraceWithException took 0.102 sec [junit] Testcase: testAppenderEvent1 took 0 sec [junit] Testcase: testAppenderEvent2 took 0.001 sec [junit] Testcase: testAppenderEvent3 took 0 sec [junit] Testcase: testAppenderEvent4 took 0 sec [junit] Testcase: testRB1 took 0 sec [junit] Testcase: testRB2 took 0 sec [junit] Testcase: testRB3 took 0 sec [junit] Testcase: testTrace took 0.1 sec [junit] Testcase: testAdditivity1 took 0.001 sec [junit] Testcase: testAdditivity2 took 0 sec [junit] Testcase: testAdditivity3 took 0 sec [junit] Testcase: testHierarchy1 took 0 sec [junit] Testcase: testIsTraceEnabled took 0 sec [junit] Testcase: testDisable1 took 0 sec [junit] Testcase: testExists took 0 sec DOM: [junit] Running org.apache.log4j.xml.DOMTestCase [junit] Testsuite: org.apache.log4j.xml.DOMTestCase [junit] Tests run: 10, Failures: 0, Errors: 0, Skipped: 0, Time elapsed: 0.13 sec [junit] Tests run: 10, Failures: 0, Errors: 0, Skipped: 0, Time elapsed: 0.13 sec [junit] ------------- Standard Output --------------- [junit] /builddir/build/BUILD/apache-log4j-1.2.17/tests/input/xml/defaultInit.xml [junit] log4j: reset attribute= "false". [junit] log4j: Threshold ="null". [junit] log4j: Level value for root is [OFF]. [junit] log4j: root level set to OFF [junit] log4j: Class name: [org.apache.log4j.ConsoleAppender] [junit] log4j: Parsing layout of class: "org.apache.log4j.PatternLayout" [junit] log4j: Setting property [conversionPattern] to [%-5p %c{2} - %m%n]. [junit] log4j: Adding appender named [D1] to category [root]. [junit] ------------- ---------------- --------------- [junit] [junit] Testcase: testReset took 0.032 sec [junit] Testcase: testOverrideSubst took 0.027 sec [junit] Testcase: testLoggerFactory1 took 0.005 sec [junit] Testcase: test1 took 0.031 sec [junit] Testcase: test4 took 0.013 sec [junit] Testcase: testConfigureAndWatch took 0.004 sec [junit] Testcase: testCategoryFactory1 took 0.002 sec [junit] Testcase: testCategoryFactory2 took 0.003 sec [junit] Testcase: testThrowableRenderer1 took 0.003 sec [junit] Testcase: testJarURL took 0.005 sec CustomLevel: [junit] Running org.apache.log4j.xml.CustomLevelTestCase [junit] Testsuite: org.apache.log4j.xml.CustomLevelTestCase [junit] Tests run: 4, Failures: 0, Errors: 0, Skipped: 0, Time elapsed: 0.071 sec [junit] Tests run: 4, Failures: 0, Errors: 0, Skipped: 0, Time elapsed: 0.071 sec [junit] ------------- Standard Output --------------- [junit] log4j: reset attribute= "false". [junit] log4j: Threshold ="null". [junit] log4j: Level value for root is [TRACE#org.apache.log4j.xml.XLevel]. [junit] log4j: toLevel:class=[org.apache.log4j.xml.XLevel]:pri=[TRACE] [junit] log4j: root level set to TRACE [junit] log4j: Class name: [org.apache.log4j.FileAppender] [junit] log4j: Setting property [append] to [false]. [junit] log4j: Setting property [file] to [output/temp]. [junit] log4j: Parsing layout of class: "org.apache.log4j.PatternLayout" [junit] log4j: Setting property [conversionPattern] to [%-5p %c{2} - %m [junit] ]. [junit] log4j: setFile called: output/temp, false [junit] log4j: setFile ended [junit] log4j: Adding appender named [TEMP] to category [root]. [junit] ------------- ---------------- --------------- [junit] [junit] Testcase: test1 took 0.051 sec [junit] Testcase: test2 took 0.007 sec [junit] Testcase: test3 took 0.005 sec [junit] Testcase: test4 took 0.005 sec CustomLogger: [junit] Running org.apache.log4j.customLogger.XLoggerTestCase [junit] Testsuite: org.apache.log4j.customLogger.XLoggerTestCase [junit] Tests run: 2, Failures: 0, Errors: 0, Skipped: 0, Time elapsed: 0.072 sec [junit] Tests run: 2, Failures: 0, Errors: 0, Skipped: 0, Time elapsed: 0.072 sec [junit] ------------- Standard Output --------------- [junit] log4j: reset attribute= "false". [junit] log4j: Threshold ="null". [junit] log4j: Level value for root is [TRACE]. [junit] log4j: Desired Level sub-class: [org.apache.log4j.xml.XLevel] [junit] log4j: root level set to TRACE [junit] log4j: Class name: [org.apache.log4j.FileAppender] [junit] log4j: Setting property [append] to [false]. [junit] log4j: Setting property [file] to [output/temp]. [junit] log4j: Parsing layout of class: "org.apache.log4j.PatternLayout" [junit] log4j: Setting property [conversionPattern] to [%-5p %c{2} - %m%n]. [junit] log4j: Setting property [levelToMatch] to [TRACE#org.apache.log4j.xml.XLevel]. [junit] log4j: toLevel:class=[org.apache.log4j.xml.XLevel]:pri=[TRACE] [junit] log4j: Setting property [acceptOnMatch] to [true]. [junit] log4j: Adding filter of type [class org.apache.log4j.varia.LevelMatchFilter] to appender named [TEMP]. [junit] log4j: Adding filter of type [class org.apache.log4j.varia.DenyAllFilter] to appender named [TEMP]. [junit] log4j: setFile called: output/temp, false [junit] log4j: setFile ended [junit] log4j: Adding appender named [TEMP] to category [root]. [junit] ------------- ---------------- --------------- [junit] [junit] Testcase: test1 took 0.06 sec [junit] Testcase: test2 took 0.008 sec PatternLayout: [junit] Running org.apache.log4j.PatternLayoutTestCase [junit] Testsuite: org.apache.log4j.PatternLayoutTestCase [junit] Tests run: 16, Failures: 0, Errors: 0, Skipped: 0, Time elapsed: 0.111 sec [junit] Tests run: 16, Failures: 0, Errors: 0, Skipped: 0, Time elapsed: 0.111 sec [junit] [junit] Testcase: testMDC1 took 0.023 sec [junit] Testcase: test10 took 0.023 sec [junit] Testcase: test11 took 0.006 sec [junit] Testcase: test12 took 0.006 sec [junit] Testcase: test13 took 0.004 sec [junit] Testcase: test14 took 0.004 sec [junit] Testcase: testMDCClear took 0.001 sec [junit] Testcase: test1 took 0.003 sec [junit] Testcase: test2 took 0.009 sec [junit] Testcase: test3 took 0.004 sec [junit] Testcase: test4 took 0.005 sec [junit] Testcase: test5 took 0.004 sec [junit] Testcase: test6 took 0.003 sec [junit] Testcase: test7 took 0.003 sec [junit] Testcase: test8 took 0.003 sec [junit] Testcase: test9 took 0.003 sec [junit] Running org.apache.log4j.EnhancedPatternLayoutTestCase [junit] Testsuite: org.apache.log4j.EnhancedPatternLayoutTestCase [junit] Tests run: 19, Failures: 0, Errors: 0, Skipped: 0, Time elapsed: 0.148 sec [junit] Tests run: 19, Failures: 0, Errors: 0, Skipped: 0, Time elapsed: 0.148 sec [junit] [junit] Testcase: testMDC1 took 0.038 sec [junit] Testcase: testMDC2 took 0.002 sec [junit] Testcase: test10 took 0.012 sec [junit] Testcase: test11 took 0.007 sec [junit] Testcase: test12 took 0.008 sec [junit] Testcase: test13 took 0.004 sec [junit] Testcase: test14 took 0.005 sec [junit] Testcase: test15 took 0.004 sec [junit] Testcase: test16 took 0.01 sec [junit] Testcase: testThrowable took 0.002 sec [junit] Testcase: test1 took 0.003 sec [junit] Testcase: test2 took 0.01 sec [junit] Testcase: test3 took 0.006 sec [junit] Testcase: test4 took 0.003 sec [junit] Testcase: test5 took 0.002 sec [junit] Testcase: test6 took 0.003 sec [junit] Testcase: test7 took 0.002 sec [junit] Testcase: test8 took 0.003 sec [junit] Testcase: test9 took 0.002 sec HierarchyThreshold: [delete] Deleting: /builddir/build/BUILD/apache-log4j-1.2.17/tests/output/temp [junit] Running org.apache.log4j.HierarchyThresholdTestCase [junit] Testsuite: org.apache.log4j.HierarchyThresholdTestCase [junit] Tests run: 8, Failures: 0, Errors: 0, Skipped: 0, Time elapsed: 0.028 sec [junit] Tests run: 8, Failures: 0, Errors: 0, Skipped: 0, Time elapsed: 0.028 sec [junit] ------------- Standard Output --------------- [junit] Tearing down test case. [junit] Tearing down test case. [junit] Tearing down test case. [junit] Tearing down test case. [junit] Tearing down test case. [junit] Tearing down test case. [junit] Tearing down test case. [junit] Tearing down test case. [junit] ------------- ---------------- --------------- [junit] [junit] Testcase: test1 took 0.019 sec [junit] Testcase: test2 took 0 sec [junit] Testcase: test3 took 0 sec [junit] Testcase: test4 took 0.002 sec [junit] Testcase: test5 took 0.001 sec [junit] Testcase: test6 took 0 sec [junit] Testcase: test7 took 0.001 sec [junit] Testcase: test8 took 0 sec DefaultInit: [junit] Running org.apache.log4j.defaultInit.TestCase1 [junit] Testsuite: org.apache.log4j.defaultInit.TestCase1 [junit] Tests run: 1, Failures: 0, Errors: 0, Skipped: 0, Time elapsed: 0.008 sec [junit] Tests run: 1, Failures: 0, Errors: 0, Skipped: 0, Time elapsed: 0.008 sec [junit] [junit] Testcase: noneTest took 0.006 sec [copy] Copying 1 file to /builddir/build/BUILD/apache-log4j-1.2.17/tests/classes [junit] Running org.apache.log4j.defaultInit.TestCase2 [junit] Testsuite: org.apache.log4j.defaultInit.TestCase2 [junit] Tests run: 1, Failures: 0, Errors: 0, Skipped: 0, Time elapsed: 0.049 sec [junit] Tests run: 1, Failures: 0, Errors: 0, Skipped: 0, Time elapsed: 0.049 sec [junit] ------------- Standard Output --------------- [junit] log4j: reset attribute= "false". [junit] log4j: Threshold ="null". [junit] log4j: Level value for root is [OFF]. [junit] log4j: root level set to OFF [junit] log4j: Class name: [org.apache.log4j.ConsoleAppender] [junit] log4j: Parsing layout of class: "org.apache.log4j.PatternLayout" [junit] log4j: Setting property [conversionPattern] to [%-5p %c{2} - %m%n]. [junit] log4j: Adding appender named [D1] to category [root]. [junit] ------------- ---------------- --------------- [junit] [junit] Testcase: xmlTest took 0.046 sec [delete] Deleting: /builddir/build/BUILD/apache-log4j-1.2.17/tests/classes/log4j.xml [copy] Copying 1 file to /builddir/build/BUILD/apache-log4j-1.2.17/tests/classes [junit] Running org.apache.log4j.defaultInit.TestCase1 [junit] Testsuite: org.apache.log4j.defaultInit.TestCase1 [junit] Tests run: 1, Failures: 0, Errors: 0, Skipped: 0, Time elapsed: 0.008 sec [junit] Tests run: 1, Failures: 0, Errors: 0, Skipped: 0, Time elapsed: 0.008 sec [junit] [junit] Testcase: noneTest took 0.005 sec [delete] Deleting: /builddir/build/BUILD/apache-log4j-1.2.17/tests/classes/log4j.xml [copy] Copying 1 file to /builddir/build/BUILD/apache-log4j-1.2.17/tests/classes [junit] Running org.apache.log4j.defaultInit.TestCase3 [junit] Testsuite: org.apache.log4j.defaultInit.TestCase3 [junit] Tests run: 1, Failures: 0, Errors: 0, Skipped: 0, Time elapsed: 0.033 sec [junit] Tests run: 1, Failures: 0, Errors: 0, Skipped: 0, Time elapsed: 0.033 sec [junit] [junit] Testcase: propertiesTest took 0.03 sec [delete] Deleting: /builddir/build/BUILD/apache-log4j-1.2.17/tests/classes/log4j.properties [copy] Copying 1 file to /builddir/build/BUILD/apache-log4j-1.2.17/tests/classes [copy] Copying 1 file to /builddir/build/BUILD/apache-log4j-1.2.17/tests/classes [junit] Running org.apache.log4j.defaultInit.TestCase4 [junit] Testsuite: org.apache.log4j.defaultInit.TestCase4 [junit] Tests run: 1, Failures: 0, Errors: 0, Skipped: 0, Time elapsed: 0.048 sec [junit] Tests run: 1, Failures: 0, Errors: 0, Skipped: 0, Time elapsed: 0.048 sec [junit] ------------- Standard Output --------------- [junit] log4j: reset attribute= "false". [junit] log4j: Threshold ="null". [junit] log4j: Level value for root is [OFF]. [junit] log4j: root level set to OFF [junit] log4j: Class name: [org.apache.log4j.ConsoleAppender] [junit] log4j: Parsing layout of class: "org.apache.log4j.PatternLayout" [junit] log4j: Setting property [conversionPattern] to [%-5p %c{2} - %m%n]. [junit] log4j: Adding appender named [D1] to category [root]. [junit] ------------- ---------------- --------------- [junit] [junit] Testcase: combinedTest took 0.044 sec [delete] Deleting: /builddir/build/BUILD/apache-log4j-1.2.17/tests/classes/log4j.xml [delete] Deleting: /builddir/build/BUILD/apache-log4j-1.2.17/tests/classes/log4j.properties SocketServer: [junit] Running org.apache.log4j.net.SocketServerTestCase [junit] Testsuite: org.apache.log4j.net.SocketServerTestCase [junit] Tests run: 8, Failures: 0, Errors: 0, Skipped: 0, Time elapsed: 12.075 sec [junit] Tests run: 8, Failures: 0, Errors: 0, Skipped: 0, Time elapsed: 12.075 sec [junit] ------------- Standard Output --------------- [junit] Setting up test case. [junit] Tearing down test case. [junit] Setting up test case. [junit] Tearing down test case. [junit] Setting up test case. [junit] Tearing down test case. [junit] Setting up test case. [junit] Tearing down test case. [junit] Setting up test case. [junit] Tearing down test case. [junit] Setting up test case. [junit] Tearing down test case. [junit] Setting up test case. [junit] Tearing down test case. [junit] Setting up test case. [junit] Tearing down test case. [junit] ------------- ---------------- --------------- [junit] [junit] Testcase: test1 took 1.041 sec [junit] Testcase: test2 took 1.006 sec [junit] Testcase: test3 took 1.005 sec [junit] Testcase: test4 took 1.005 sec [junit] Testcase: test5 took 2.005 sec [junit] Testcase: test6 took 2.003 sec [junit] Testcase: test7 took 2.003 sec [junit] Testcase: test8 took 2.003 sec XMLLayout: [junit] Running org.apache.log4j.xml.XMLLayoutTestCase [junit] Testsuite: org.apache.log4j.xml.XMLLayoutTestCase [junit] Tests run: 6, Failures: 0, Errors: 0, Skipped: 0, Time elapsed: 0.049 sec [junit] Tests run: 6, Failures: 0, Errors: 0, Skipped: 0, Time elapsed: 0.049 sec [junit] [junit] Testcase: basic took 0.029 sec [junit] Testcase: locationInfo took 0.009 sec [junit] Testcase: testCDATA took 0.002 sec [junit] Testcase: testNull took 0.002 sec [junit] Testcase: testMDC took 0.002 sec [junit] Testcase: testMDCEscaped took 0 sec AsyncAppender: [junit] Running org.apache.log4j.AsyncAppenderTestCase [junit] Testsuite: org.apache.log4j.AsyncAppenderTestCase [junit] Tests run: 6, Failures: 0, Errors: 0, Skipped: 0, Time elapsed: 21.85 sec [junit] Tests run: 6, Failures: 0, Errors: 0, Skipped: 0, Time elapsed: 21.85 sec [junit] ------------- Standard Output --------------- [junit] Done loop. [junit] ------------- ---------------- --------------- [junit] ------------- Standard Error ----------------- [junit] log4j:ERROR Attempted to append to closed appender named [async-test2]. [junit] log4j:ERROR Attempted to append to closed appender named [async-test3]. [junit] ------------- ---------------- --------------- [junit] [junit] Testcase: testBadAppender took 0.007 sec [junit] Testcase: testLocationInfoTrue took 0.818 sec [junit] Testcase: test2 took 0.101 sec [junit] Testcase: test3 took 20.014 sec [junit] Testcase: testLocationInfoFalse took 0.806 sec [junit] Testcase: testMutableMessage took 0.101 sec OptionConverter: [junit] Running org.apache.log4j.helpers.OptionConverterTestCase [junit] Testsuite: org.apache.log4j.helpers.OptionConverterTestCase [junit] Tests run: 11, Failures: 0, Errors: 0, Skipped: 0, Time elapsed: 0.037 sec [junit] Tests run: 11, Failures: 0, Errors: 0, Skipped: 0, Time elapsed: 0.037 sec [junit] ------------- Standard Output --------------- [junit] Result is [x1]. [junit] ------------- ---------------- --------------- [junit] ------------- Standard Error ----------------- [junit] log4j:WARN custom level class [org.apache.log4j.xml.TOTO] not found. [junit] ------------- ---------------- --------------- [junit] [junit] Testcase: varSubstTest5 took 0.006 sec [junit] Testcase: varSubstTest1 took 0 sec [junit] Testcase: varSubstTest2 took 0 sec [junit] Testcase: varSubstTest3 took 0.001 sec [junit] Testcase: varSubstTest4 took 0 sec [junit] Testcase: testInputStream took 0.023 sec [junit] Testcase: toLevelTest1 took 0 sec [junit] Testcase: toLevelTest2 took 0.001 sec [junit] Testcase: toLevelTest3 took 0 sec [junit] Testcase: toLevelTest4 took 0 sec [junit] Testcase: toLevelTest5 took 0 sec BoundedFIFO: [junit] Running org.apache.log4j.helpers.BoundedFIFOTestCase [junit] Testsuite: org.apache.log4j.helpers.BoundedFIFOTestCase [junit] Tests run: 5, Failures: 0, Errors: 0, Skipped: 0, Time elapsed: 0.018 sec [junit] Tests run: 5, Failures: 0, Errors: 0, Skipped: 0, Time elapsed: 0.018 sec [junit] [junit] Testcase: test1 took 0.008 sec [junit] Testcase: test2 took 0 sec [junit] Testcase: testResize1 took 0.001 sec [junit] Testcase: testResize2 took 0.004 sec [junit] Testcase: testResize3 took 0.002 sec CyclicBuffer: [junit] Running org.apache.log4j.helpers.CyclicBufferTestCase [junit] Testsuite: org.apache.log4j.helpers.CyclicBufferTestCase [junit] Tests run: 3, Failures: 0, Errors: 0, Skipped: 0, Time elapsed: 0.012 sec [junit] Tests run: 3, Failures: 0, Errors: 0, Skipped: 0, Time elapsed: 0.012 sec [junit] [junit] Testcase: test0 took 0.001 sec [junit] Testcase: test1 took 0.008 sec [junit] Testcase: testResize took 0.001 sec OR: [junit] Running org.apache.log4j.or.ORTestCase [junit] Testsuite: org.apache.log4j.or.ORTestCase [junit] Tests run: 10, Failures: 0, Errors: 0, Skipped: 0, Time elapsed: 0.009 sec [junit] Tests run: 10, Failures: 0, Errors: 0, Skipped: 0, Time elapsed: 0.009 sec [junit] [junit] Testcase: test1 took 0.001 sec [junit] Testcase: test2 took 0 sec [junit] Testcase: test3 took 0 sec [junit] Testcase: test4 took 0.001 sec [junit] Testcase: test5 took 0 sec [junit] Testcase: test6 took 0.001 sec [junit] Testcase: test7 took 0 sec [junit] Testcase: test8 took 0 sec [junit] Testcase: test9 took 0.001 sec [junit] Testcase: test10 took 0 sec LevelMatchFilter: [junit] Running org.apache.log4j.varia.LevelMatchFilterTestCase [junit] Testsuite: org.apache.log4j.varia.LevelMatchFilterTestCase [junit] Tests run: 2, Failures: 0, Errors: 0, Skipped: 0, Time elapsed: 0.02 sec [junit] Tests run: 2, Failures: 0, Errors: 0, Skipped: 0, Time elapsed: 0.02 sec [junit] [junit] Testcase: accept took 0.016 sec [junit] Testcase: deny took 0.001 sec PatternParser: [junit] Running org.apache.log4j.helpers.PatternParserTestCase [junit] Testsuite: org.apache.log4j.helpers.PatternParserTestCase [junit] Tests run: 1, Failures: 0, Errors: 0, Skipped: 0, Time elapsed: 0.015 sec [junit] Tests run: 1, Failures: 0, Errors: 0, Skipped: 0, Time elapsed: 0.015 sec [junit] [junit] Testcase: mdcPattern took 0.012 sec ErrorHandler: [junit] Running org.apache.log4j.varia.ErrorHandlerTestCase [junit] Testsuite: org.apache.log4j.varia.ErrorHandlerTestCase [junit] Tests run: 2, Failures: 0, Errors: 0, Skipped: 0, Time elapsed: 0.078 sec [junit] Tests run: 2, Failures: 0, Errors: 0, Skipped: 0, Time elapsed: 0.078 sec [junit] ------------- Standard Output --------------- [junit] log4j: reset attribute= "false". [junit] log4j: Threshold ="null". [junit] log4j: Level value for root is [debug]. [junit] log4j: root level set to DEBUG [junit] log4j: Class name: [org.apache.log4j.FileAppender] [junit] log4j: FB: Setting primary appender to [PRIMARY]. [junit] log4j: FB: Adding logger [root]. [junit] log4j: Class name: [org.apache.log4j.FileAppender] [junit] log4j: Setting property [file] to [output/temp]. [junit] log4j: Setting property [append] to [false]. [junit] log4j: Parsing layout of class: "org.apache.log4j.PatternLayout" [junit] log4j: Setting property [conversionPattern] to [FALLBACK - %c - %m%n]. [junit] log4j: setFile called: output/temp, false [junit] log4j: setFile ended [junit] log4j: FB: Setting backup appender to [FALLBACK]. [junit] log4j: Setting property [file] to []. [junit] log4j: Setting property [append] to [false]. [junit] log4j: Parsing layout of class: "org.apache.log4j.PatternLayout" [junit] log4j: Setting property [conversionPattern] to [%-5p %c{2} - %m%n]. [junit] log4j: setFile called: , false [junit] log4j: FB: The following error reported: setFile(null,false) call failed. [junit] java.io.FileNotFoundException: (No such file or directory) [junit] at java.io.FileOutputStream.open0(Native Method) [junit] at java.io.FileOutputStream.open(FileOutputStream.java:270) [junit] at java.io.FileOutputStream.(FileOutputStream.java:213) [junit] at java.io.FileOutputStream.(FileOutputStream.java:133) [junit] at org.apache.log4j.FileAppender.setFile(FileAppender.java:294) [junit] at org.apache.log4j.FileAppender.activateOptions(FileAppender.java:165) [junit] at org.apache.log4j.config.PropertySetter.activate(PropertySetter.java:307) [junit] at org.apache.log4j.xml.DOMConfigurator.parseAppender(DOMConfigurator.java:295) [junit] at org.apache.log4j.xml.DOMConfigurator.findAppenderByName(DOMConfigurator.java:176) [junit] at org.apache.log4j.xml.DOMConfigurator.findAppenderByReference(DOMConfigurator.java:191) [junit] at org.apache.log4j.xml.DOMConfigurator.parseChildrenOfLoggerElement(DOMConfigurator.java:523) [junit] at org.apache.log4j.xml.DOMConfigurator.parseRoot(DOMConfigurator.java:492) [junit] at org.apache.log4j.xml.DOMConfigurator.parse(DOMConfigurator.java:1006) [junit] at org.apache.log4j.xml.DOMConfigurator.doConfigure(DOMConfigurator.java:872) [junit] at org.apache.log4j.xml.DOMConfigurator.doConfigure(DOMConfigurator.java:755) [junit] at org.apache.log4j.xml.DOMConfigurator.configure(DOMConfigurator.java:896) [junit] at org.apache.log4j.varia.ErrorHandlerTestCase.test1(ErrorHandlerTestCase.java:66) [junit] at sun.reflect.NativeMethodAccessorImpl.invoke0(Native Method) [junit] at sun.reflect.NativeMethodAccessorImpl.invoke(NativeMethodAccessorImpl.java:62) [junit] at sun.reflect.DelegatingMethodAccessorImpl.invoke(DelegatingMethodAccessorImpl.java:43) [junit] at java.lang.reflect.Method.invoke(Method.java:498) [junit] at junit.framework.TestCase.runTest(TestCase.java:176) [junit] at junit.framework.TestCase.runBare(TestCase.java:141) [junit] at junit.framework.TestResult$1.protect(TestResult.java:122) [junit] at junit.framework.TestResult.runProtected(TestResult.java:142) [junit] at junit.framework.TestResult.run(TestResult.java:125) [junit] at junit.framework.TestCase.run(TestCase.java:129) [junit] at junit.framework.TestSuite.runTest(TestSuite.java:255) [junit] at junit.framework.TestSuite.run(TestSuite.java:250) [junit] at org.apache.tools.ant.taskdefs.optional.junit.JUnitTestRunner.run(JUnitTestRunner.java:532) [junit] at org.apache.tools.ant.taskdefs.optional.junit.JUnitTestRunner.launch(JUnitTestRunner.java:1179) [junit] at org.apache.tools.ant.taskdefs.optional.junit.JUnitTestRunner.main(JUnitTestRunner.java:1030) [junit] log4j: FB: INITIATING FALLBACK PROCEDURE. [junit] log4j: FB: Searching for [PRIMARY] in logger [root]. [junit] log4j: FB: Replacing [PRIMARY] by [FALLBACK] in logger [root]. [junit] log4j: FB: Adding appender [FALLBACK] to logger root [junit] log4j: Adding appender named [PRIMARY] to category [root]. [junit] log4j: Parsing for [root] with value=[DEBUG, PRIMARY]. [junit] log4j: Level token is [DEBUG]. [junit] log4j: Category root set to DEBUG [junit] log4j: Parsing appender named "PRIMARY". [junit] log4j: Parsing layout options for "PRIMARY". [junit] log4j: Setting property [conversionPattern] to [%-5p %c{2} - %m%n]. [junit] log4j: End of parsing for "PRIMARY". [junit] log4j: Parsing errorhandler options for "PRIMARY". [junit] log4j: End of errorhandler parsing for "PRIMARY". [junit] log4j: Setting property [append] to [false]. [junit] log4j: Setting property [file] to [/xyz/:x.log]. [junit] log4j: setFile called: /xyz/:x.log, false [junit] log4j: FB: The following error reported: setFile(null,false) call failed. [junit] java.io.FileNotFoundException: /xyz/:x.log (No such file or directory) [junit] at java.io.FileOutputStream.open0(Native Method) [junit] at java.io.FileOutputStream.open(FileOutputStream.java:270) [junit] at java.io.FileOutputStream.(FileOutputStream.java:213) [junit] at java.io.FileOutputStream.(FileOutputStream.java:133) [junit] at org.apache.log4j.FileAppender.setFile(FileAppender.java:294) [junit] at org.apache.log4j.FileAppender.activateOptions(FileAppender.java:165) [junit] at org.apache.log4j.config.PropertySetter.activate(PropertySetter.java:307) [junit] at org.apache.log4j.config.PropertySetter.setProperties(PropertySetter.java:172) [junit] at org.apache.log4j.config.PropertySetter.setProperties(PropertySetter.java:104) [junit] at org.apache.log4j.PropertyConfigurator.parseAppender(PropertyConfigurator.java:842) [junit] at org.apache.log4j.PropertyConfigurator.parseCategory(PropertyConfigurator.java:768) [junit] at org.apache.log4j.PropertyConfigurator.configureRootCategory(PropertyConfigurator.java:648) [junit] at org.apache.log4j.PropertyConfigurator.doConfigure(PropertyConfigurator.java:514) [junit] at org.apache.log4j.PropertyConfigurator.doConfigure(PropertyConfigurator.java:395) [junit] at org.apache.log4j.PropertyConfigurator.configure(PropertyConfigurator.java:403) [junit] at org.apache.log4j.varia.ErrorHandlerTestCase.test2(ErrorHandlerTestCase.java:86) [junit] at sun.reflect.NativeMethodAccessorImpl.invoke0(Native Method) [junit] at sun.reflect.NativeMethodAccessorImpl.invoke(NativeMethodAccessorImpl.java:62) [junit] at sun.reflect.DelegatingMethodAccessorImpl.invoke(DelegatingMethodAccessorImpl.java:43) [junit] at java.lang.reflect.Method.invoke(Method.java:498) [junit] at junit.framework.TestCase.runTest(TestCase.java:176) [junit] at junit.framework.TestCase.runBare(TestCase.java:141) [junit] at junit.framework.TestResult$1.protect(TestResult.java:122) [junit] at junit.framework.TestResult.runProtected(TestResult.java:142) [junit] at junit.framework.TestResult.run(TestResult.java:125) [junit] at junit.framework.TestCase.run(TestCase.java:129) [junit] at junit.framework.TestSuite.runTest(TestSuite.java:255) [junit] at junit.framework.TestSuite.run(TestSuite.java:250) [junit] at org.apache.tools.ant.taskdefs.optional.junit.JUnitTestRunner.run(JUnitTestRunner.java:532) [junit] at org.apache.tools.ant.taskdefs.optional.junit.JUnitTestRunner.launch(JUnitTestRunner.java:1179) [junit] at org.apache.tools.ant.taskdefs.optional.junit.JUnitTestRunner.main(JUnitTestRunner.java:1030) [junit] log4j: FB: INITIATING FALLBACK PROCEDURE. [junit] log4j: Parsed "PRIMARY" options. [junit] log4j: Finished configuring. [junit] ------------- ---------------- --------------- [junit] [junit] Testcase: test1 took 0.07 sec [junit] Testcase: test2 took 0.005 sec Rewrite: [junit] Running org.apache.log4j.rewrite.RewriteAppenderTest [junit] Testsuite: org.apache.log4j.rewrite.RewriteAppenderTest [junit] Tests run: 3, Failures: 0, Errors: 0, Skipped: 0, Time elapsed: 0.059 sec [junit] Tests run: 3, Failures: 0, Errors: 0, Skipped: 0, Time elapsed: 0.059 sec [junit] [junit] Testcase: testReflectionPolicy took 0.051 sec [junit] Testcase: testPropertyPolicy took 0.004 sec [junit] Testcase: testMapPolicy took 0.002 sec regression: longUnit: runAll: [INFO] Executed tasks [INFO] [INFO] --- maven-bundle-plugin:2.3.7:bundle (default-bundle) @ log4j --- [WARNING] Bundle log4j:log4j:bundle:1.2.17 : Did not find matching referal for !com.ibm.uvm.tools.* [WARNING] Bundle log4j:log4j:bundle:1.2.17 : Did not find matching referal for !com.sun.jdmk.comm.* [WARNING] Bundle log4j:log4j:bundle:1.2.17 : Did not find matching referal for !javax.jmdns.* [INFO] [INFO] --- maven-javadoc-plugin:2.9:jar (default) @ log4j --- [INFO] Loading source files for package org.apache.log4j.pattern... Loading source files for package org.apache.log4j.helpers... Loading source files for package org.apache.log4j.or.jms... Loading source files for package org.apache.log4j.or.sax... Loading source files for package org.apache.log4j.or... Loading source files for package org.apache.log4j.jdbc... Loading source files for package org.apache.log4j.config... Loading source files for package org.apache.log4j.chainsaw... Loading source files for package org.apache.log4j.jmx... Loading source files for package org.apache.log4j.nt... Loading source files for package org.apache.log4j.spi... Loading source files for package org.apache.log4j.lf5.util... Loading source files for package org.apache.log4j.lf5.viewer.configure... Loading source files for package org.apache.log4j.lf5.viewer.categoryexplorer... Loading source files for package org.apache.log4j.lf5.viewer... Loading source files for package org.apache.log4j.lf5... Loading source files for package org.apache.log4j.net... Loading source files for package org.apache.log4j.rewrite... Loading source files for package org.apache.log4j.xml... Loading source files for package org.apache.log4j.varia... Loading source files for package org.apache.log4j... Loading source files for package org.apache.log4j.xml.examples... Constructing Javadoc information... Standard Doclet version 1.8.0_242 Building tree for all the packages and classes... Generating /builddir/build/BUILD/apache-log4j-1.2.17/target/apidocs/org/apache/log4j/pattern/BridgePatternConverter.html... Generating /builddir/build/BUILD/apache-log4j-1.2.17/target/apidocs/org/apache/log4j/pattern/BridgePatternParser.html... Generating /builddir/build/BUILD/apache-log4j-1.2.17/target/apidocs/org/apache/log4j/pattern/CachedDateFormat.html... Generating /builddir/build/BUILD/apache-log4j-1.2.17/target/apidocs/org/apache/log4j/pattern/ClassNamePatternConverter.html... Generating /builddir/build/BUILD/apache-log4j-1.2.17/target/apidocs/org/apache/log4j/pattern/DatePatternConverter.html... Generating /builddir/build/BUILD/apache-log4j-1.2.17/target/apidocs/org/apache/log4j/pattern/FileDatePatternConverter.html... Generating /builddir/build/BUILD/apache-log4j-1.2.17/target/apidocs/org/apache/log4j/pattern/FileLocationPatternConverter.html... Generating /builddir/build/BUILD/apache-log4j-1.2.17/target/apidocs/org/apache/log4j/pattern/FormattingInfo.html... Generating /builddir/build/BUILD/apache-log4j-1.2.17/target/apidocs/org/apache/log4j/pattern/FullLocationPatternConverter.html... Generating /builddir/build/BUILD/apache-log4j-1.2.17/target/apidocs/org/apache/log4j/pattern/IntegerPatternConverter.html... Generating /builddir/build/BUILD/apache-log4j-1.2.17/target/apidocs/org/apache/log4j/pattern/LevelPatternConverter.html... Generating /builddir/build/BUILD/apache-log4j-1.2.17/target/apidocs/org/apache/log4j/pattern/LineLocationPatternConverter.html... Generating /builddir/build/BUILD/apache-log4j-1.2.17/target/apidocs/org/apache/log4j/pattern/LineSeparatorPatternConverter.html... Generating /builddir/build/BUILD/apache-log4j-1.2.17/target/apidocs/org/apache/log4j/pattern/LiteralPatternConverter.html... Generating /builddir/build/BUILD/apache-log4j-1.2.17/target/apidocs/org/apache/log4j/pattern/LogEvent.html... Generating /builddir/build/BUILD/apache-log4j-1.2.17/target/apidocs/org/apache/log4j/pattern/LoggerPatternConverter.html... Generating /builddir/build/BUILD/apache-log4j-1.2.17/target/apidocs/org/apache/log4j/pattern/LoggingEventPatternConverter.html... Generating /builddir/build/BUILD/apache-log4j-1.2.17/target/apidocs/org/apache/log4j/pattern/MessagePatternConverter.html... Generating /builddir/build/BUILD/apache-log4j-1.2.17/target/apidocs/org/apache/log4j/pattern/MethodLocationPatternConverter.html... Generating /builddir/build/BUILD/apache-log4j-1.2.17/target/apidocs/org/apache/log4j/pattern/NameAbbreviator.html... Generating /builddir/build/BUILD/apache-log4j-1.2.17/target/apidocs/org/apache/log4j/pattern/NamePatternConverter.html... Generating /builddir/build/BUILD/apache-log4j-1.2.17/target/apidocs/org/apache/log4j/pattern/NDCPatternConverter.html... Generating /builddir/build/BUILD/apache-log4j-1.2.17/target/apidocs/org/apache/log4j/pattern/PatternConverter.html... Generating /builddir/build/BUILD/apache-log4j-1.2.17/target/apidocs/org/apache/log4j/pattern/PatternParser.html... Generating /builddir/build/BUILD/apache-log4j-1.2.17/target/apidocs/org/apache/log4j/pattern/PropertiesPatternConverter.html... Generating /builddir/build/BUILD/apache-log4j-1.2.17/target/apidocs/org/apache/log4j/pattern/RelativeTimePatternConverter.html... Generating /builddir/build/BUILD/apache-log4j-1.2.17/target/apidocs/org/apache/log4j/pattern/SequenceNumberPatternConverter.html... Generating /builddir/build/BUILD/apache-log4j-1.2.17/target/apidocs/org/apache/log4j/pattern/ThreadPatternConverter.html... Generating /builddir/build/BUILD/apache-log4j-1.2.17/target/apidocs/org/apache/log4j/pattern/ThrowableInformationPatternConverter.html... Generating /builddir/build/BUILD/apache-log4j-1.2.17/target/apidocs/org/apache/log4j/helpers/AbsoluteTimeDateFormat.html... Generating /builddir/build/BUILD/apache-log4j-1.2.17/target/apidocs/org/apache/log4j/helpers/AppenderAttachableImpl.html... Generating /builddir/build/BUILD/apache-log4j-1.2.17/target/apidocs/org/apache/log4j/helpers/BoundedFIFO.html... Generating /builddir/build/BUILD/apache-log4j-1.2.17/target/apidocs/org/apache/log4j/helpers/CountingQuietWriter.html... Generating /builddir/build/BUILD/apache-log4j-1.2.17/target/apidocs/org/apache/log4j/helpers/CyclicBuffer.html... Generating /builddir/build/BUILD/apache-log4j-1.2.17/target/apidocs/org/apache/log4j/helpers/DateLayout.html... Generating /builddir/build/BUILD/apache-log4j-1.2.17/target/apidocs/org/apache/log4j/helpers/DateTimeDateFormat.html... Generating /builddir/build/BUILD/apache-log4j-1.2.17/target/apidocs/org/apache/log4j/helpers/FileWatchdog.html... Generating /builddir/build/BUILD/apache-log4j-1.2.17/target/apidocs/org/apache/log4j/helpers/FormattingInfo.html... Generating /builddir/build/BUILD/apache-log4j-1.2.17/target/apidocs/org/apache/log4j/helpers/ISO8601DateFormat.html... Generating /builddir/build/BUILD/apache-log4j-1.2.17/target/apidocs/org/apache/log4j/helpers/Loader.html... Generating /builddir/build/BUILD/apache-log4j-1.2.17/target/apidocs/org/apache/log4j/helpers/LogLog.html... Generating /builddir/build/BUILD/apache-log4j-1.2.17/target/apidocs/org/apache/log4j/helpers/MDCKeySetExtractor.html... Generating /builddir/build/BUILD/apache-log4j-1.2.17/target/apidocs/org/apache/log4j/helpers/NullEnumeration.html... Generating /builddir/build/BUILD/apache-log4j-1.2.17/target/apidocs/org/apache/log4j/helpers/OnlyOnceErrorHandler.html... Generating /builddir/build/BUILD/apache-log4j-1.2.17/target/apidocs/org/apache/log4j/helpers/OptionConverter.html... Generating /builddir/build/BUILD/apache-log4j-1.2.17/target/apidocs/org/apache/log4j/helpers/PatternConverter.html... Generating /builddir/build/BUILD/apache-log4j-1.2.17/target/apidocs/org/apache/log4j/helpers/PatternParser.html... Generating /builddir/build/BUILD/apache-log4j-1.2.17/target/apidocs/org/apache/log4j/helpers/QuietWriter.html... Generating /builddir/build/BUILD/apache-log4j-1.2.17/target/apidocs/org/apache/log4j/helpers/RelativeTimeDateFormat.html... Generating /builddir/build/BUILD/apache-log4j-1.2.17/target/apidocs/org/apache/log4j/helpers/SyslogQuietWriter.html... Generating /builddir/build/BUILD/apache-log4j-1.2.17/target/apidocs/org/apache/log4j/helpers/SyslogWriter.html... Generating /builddir/build/BUILD/apache-log4j-1.2.17/target/apidocs/org/apache/log4j/helpers/ThreadLocalMap.html... Generating /builddir/build/BUILD/apache-log4j-1.2.17/target/apidocs/org/apache/log4j/helpers/Transform.html... Generating /builddir/build/BUILD/apache-log4j-1.2.17/target/apidocs/org/apache/log4j/helpers/UtilLoggingLevel.html... Generating /builddir/build/BUILD/apache-log4j-1.2.17/target/apidocs/org/apache/log4j/or/jms/MessageRenderer.html... Generating /builddir/build/BUILD/apache-log4j-1.2.17/target/apidocs/org/apache/log4j/or/sax/AttributesRenderer.html... Generating /builddir/build/BUILD/apache-log4j-1.2.17/target/apidocs/org/apache/log4j/or/ObjectRenderer.html... Generating /builddir/build/BUILD/apache-log4j-1.2.17/target/apidocs/org/apache/log4j/or/RendererMap.html... Generating /builddir/build/BUILD/apache-log4j-1.2.17/target/apidocs/org/apache/log4j/or/ThreadGroupRenderer.html... Generating /builddir/build/BUILD/apache-log4j-1.2.17/target/apidocs/org/apache/log4j/jdbc/JDBCAppender.html... Generating /builddir/build/BUILD/apache-log4j-1.2.17/target/apidocs/org/apache/log4j/config/PropertyGetter.html... Generating /builddir/build/BUILD/apache-log4j-1.2.17/target/apidocs/org/apache/log4j/config/PropertyGetter.PropertyCallback.html... Generating /builddir/build/BUILD/apache-log4j-1.2.17/target/apidocs/org/apache/log4j/config/PropertyPrinter.html... Generating /builddir/build/BUILD/apache-log4j-1.2.17/target/apidocs/org/apache/log4j/config/PropertySetter.html... Generating /builddir/build/BUILD/apache-log4j-1.2.17/target/apidocs/org/apache/log4j/config/PropertySetterException.html... Generating /builddir/build/BUILD/apache-log4j-1.2.17/target/apidocs/org/apache/log4j/chainsaw/Main.html... Generating /builddir/build/BUILD/apache-log4j-1.2.17/target/apidocs/org/apache/log4j/jmx/AbstractDynamicMBean.html... Generating /builddir/build/BUILD/apache-log4j-1.2.17/target/apidocs/org/apache/log4j/jmx/Agent.html... Generating /builddir/build/BUILD/apache-log4j-1.2.17/target/apidocs/org/apache/log4j/jmx/AppenderDynamicMBean.html... Generating /builddir/build/BUILD/apache-log4j-1.2.17/target/apidocs/org/apache/log4j/jmx/HierarchyDynamicMBean.html... Generating /builddir/build/BUILD/apache-log4j-1.2.17/target/apidocs/org/apache/log4j/jmx/LayoutDynamicMBean.html... Generating /builddir/build/BUILD/apache-log4j-1.2.17/target/apidocs/org/apache/log4j/jmx/LoggerDynamicMBean.html... Generating /builddir/build/BUILD/apache-log4j-1.2.17/target/apidocs/org/apache/log4j/nt/NTEventLogAppender.html... Generating /builddir/build/BUILD/apache-log4j-1.2.17/target/apidocs/org/apache/log4j/spi/AppenderAttachable.html... Generating /builddir/build/BUILD/apache-log4j-1.2.17/target/apidocs/org/apache/log4j/spi/Configurator.html... Generating /builddir/build/BUILD/apache-log4j-1.2.17/target/apidocs/org/apache/log4j/spi/DefaultRepositorySelector.html... Generating /builddir/build/BUILD/apache-log4j-1.2.17/target/apidocs/org/apache/log4j/spi/ErrorCode.html... Generating /builddir/build/BUILD/apache-log4j-1.2.17/target/apidocs/org/apache/log4j/spi/ErrorHandler.html... Generating /builddir/build/BUILD/apache-log4j-1.2.17/target/apidocs/org/apache/log4j/spi/Filter.html... Generating /builddir/build/BUILD/apache-log4j-1.2.17/target/apidocs/org/apache/log4j/spi/HierarchyEventListener.html... Generating /builddir/build/BUILD/apache-log4j-1.2.17/target/apidocs/org/apache/log4j/spi/LocationInfo.html... Generating /builddir/build/BUILD/apache-log4j-1.2.17/target/apidocs/org/apache/log4j/spi/LoggerFactory.html... Generating /builddir/build/BUILD/apache-log4j-1.2.17/target/apidocs/org/apache/log4j/spi/LoggerRepository.html... Generating /builddir/build/BUILD/apache-log4j-1.2.17/target/apidocs/org/apache/log4j/spi/LoggingEvent.html... Generating /builddir/build/BUILD/apache-log4j-1.2.17/target/apidocs/org/apache/log4j/spi/NOPLogger.html... Generating /builddir/build/BUILD/apache-log4j-1.2.17/target/apidocs/org/apache/log4j/spi/NOPLoggerRepository.html... Generating /builddir/build/BUILD/apache-log4j-1.2.17/target/apidocs/org/apache/log4j/spi/OptionHandler.html... Generating /builddir/build/BUILD/apache-log4j-1.2.17/target/apidocs/org/apache/log4j/spi/RendererSupport.html... Generating /builddir/build/BUILD/apache-log4j-1.2.17/target/apidocs/org/apache/log4j/spi/RepositorySelector.html... Generating /builddir/build/BUILD/apache-log4j-1.2.17/target/apidocs/org/apache/log4j/spi/RootCategory.html... Generating /builddir/build/BUILD/apache-log4j-1.2.17/target/apidocs/org/apache/log4j/spi/RootLogger.html... Generating /builddir/build/BUILD/apache-log4j-1.2.17/target/apidocs/org/apache/log4j/spi/ThrowableInformation.html... Generating /builddir/build/BUILD/apache-log4j-1.2.17/target/apidocs/org/apache/log4j/spi/ThrowableRenderer.html... Generating /builddir/build/BUILD/apache-log4j-1.2.17/target/apidocs/org/apache/log4j/spi/ThrowableRendererSupport.html... Generating /builddir/build/BUILD/apache-log4j-1.2.17/target/apidocs/org/apache/log4j/spi/TriggeringEventEvaluator.html... Generating /builddir/build/BUILD/apache-log4j-1.2.17/target/apidocs/org/apache/log4j/lf5/util/AdapterLogRecord.html... Generating /builddir/build/BUILD/apache-log4j-1.2.17/target/apidocs/org/apache/log4j/lf5/util/DateFormatManager.html... Generating /builddir/build/BUILD/apache-log4j-1.2.17/target/apidocs/org/apache/log4j/lf5/util/LogFileParser.html... Generating /builddir/build/BUILD/apache-log4j-1.2.17/target/apidocs/org/apache/log4j/lf5/util/LogMonitorAdapter.html... Generating /builddir/build/BUILD/apache-log4j-1.2.17/target/apidocs/org/apache/log4j/lf5/util/Resource.html... Generating /builddir/build/BUILD/apache-log4j-1.2.17/target/apidocs/org/apache/log4j/lf5/util/ResourceUtils.html... Generating /builddir/build/BUILD/apache-log4j-1.2.17/target/apidocs/org/apache/log4j/lf5/util/StreamUtils.html... Generating /builddir/build/BUILD/apache-log4j-1.2.17/target/apidocs/org/apache/log4j/lf5/viewer/configure/ConfigurationManager.html... Generating /builddir/build/BUILD/apache-log4j-1.2.17/target/apidocs/org/apache/log4j/lf5/viewer/configure/MRUFileManager.html... Generating /builddir/build/BUILD/apache-log4j-1.2.17/target/apidocs/org/apache/log4j/lf5/viewer/categoryexplorer/CategoryAbstractCellEditor.html... Generating /builddir/build/BUILD/apache-log4j-1.2.17/target/apidocs/org/apache/log4j/lf5/viewer/categoryexplorer/CategoryElement.html... Generating /builddir/build/BUILD/apache-log4j-1.2.17/target/apidocs/org/apache/log4j/lf5/viewer/categoryexplorer/CategoryExplorerLogRecordFilter.html... Generating /builddir/build/BUILD/apache-log4j-1.2.17/target/apidocs/org/apache/log4j/lf5/viewer/categoryexplorer/CategoryExplorerModel.html... Generating /builddir/build/BUILD/apache-log4j-1.2.17/target/apidocs/org/apache/log4j/lf5/viewer/categoryexplorer/CategoryExplorerTree.html... Generating /builddir/build/BUILD/apache-log4j-1.2.17/target/apidocs/org/apache/log4j/lf5/viewer/categoryexplorer/CategoryImmediateEditor.html... Generating /builddir/build/BUILD/apache-log4j-1.2.17/target/apidocs/org/apache/log4j/lf5/viewer/categoryexplorer/CategoryNode.html... Generating /builddir/build/BUILD/apache-log4j-1.2.17/target/apidocs/org/apache/log4j/lf5/viewer/categoryexplorer/CategoryNodeEditor.html... Generating /builddir/build/BUILD/apache-log4j-1.2.17/target/apidocs/org/apache/log4j/lf5/viewer/categoryexplorer/CategoryNodeEditorRenderer.html... Generating /builddir/build/BUILD/apache-log4j-1.2.17/target/apidocs/org/apache/log4j/lf5/viewer/categoryexplorer/CategoryNodeRenderer.html... Generating /builddir/build/BUILD/apache-log4j-1.2.17/target/apidocs/org/apache/log4j/lf5/viewer/categoryexplorer/CategoryPath.html... Generating /builddir/build/BUILD/apache-log4j-1.2.17/target/apidocs/org/apache/log4j/lf5/viewer/categoryexplorer/TreeModelAdapter.html... Generating /builddir/build/BUILD/apache-log4j-1.2.17/target/apidocs/org/apache/log4j/lf5/viewer/FilteredLogTableModel.html... Generating /builddir/build/BUILD/apache-log4j-1.2.17/target/apidocs/org/apache/log4j/lf5/viewer/LF5SwingUtils.html... Generating /builddir/build/BUILD/apache-log4j-1.2.17/target/apidocs/org/apache/log4j/lf5/viewer/LogBrokerMonitor.html... Generating /builddir/build/BUILD/apache-log4j-1.2.17/target/apidocs/org/apache/log4j/lf5/viewer/LogFactor5Dialog.html... Generating /builddir/build/BUILD/apache-log4j-1.2.17/target/apidocs/org/apache/log4j/lf5/viewer/LogFactor5ErrorDialog.html... Generating /builddir/build/BUILD/apache-log4j-1.2.17/target/apidocs/org/apache/log4j/lf5/viewer/LogFactor5InputDialog.html... Generating /builddir/build/BUILD/apache-log4j-1.2.17/target/apidocs/org/apache/log4j/lf5/viewer/LogFactor5LoadingDialog.html... Generating /builddir/build/BUILD/apache-log4j-1.2.17/target/apidocs/org/apache/log4j/lf5/viewer/LogTable.html... Generating /builddir/build/BUILD/apache-log4j-1.2.17/target/apidocs/org/apache/log4j/lf5/viewer/LogTableColumn.html... Generating /builddir/build/BUILD/apache-log4j-1.2.17/target/apidocs/org/apache/log4j/lf5/viewer/LogTableColumnFormatException.html... Generating /builddir/build/BUILD/apache-log4j-1.2.17/target/apidocs/org/apache/log4j/lf5/viewer/LogTableModel.html... Generating /builddir/build/BUILD/apache-log4j-1.2.17/target/apidocs/org/apache/log4j/lf5/viewer/LogTableRowRenderer.html... Generating /builddir/build/BUILD/apache-log4j-1.2.17/target/apidocs/org/apache/log4j/lf5/viewer/TrackingAdjustmentListener.html... Generating /builddir/build/BUILD/apache-log4j-1.2.17/target/apidocs/org/apache/log4j/lf5/AppenderFinalizer.html... Generating /builddir/build/BUILD/apache-log4j-1.2.17/target/apidocs/org/apache/log4j/lf5/DefaultLF5Configurator.html... Generating /builddir/build/BUILD/apache-log4j-1.2.17/target/apidocs/org/apache/log4j/lf5/LF5Appender.html... Generating /builddir/build/BUILD/apache-log4j-1.2.17/target/apidocs/org/apache/log4j/lf5/Log4JLogRecord.html... Generating /builddir/build/BUILD/apache-log4j-1.2.17/target/apidocs/org/apache/log4j/lf5/LogLevel.html... Generating /builddir/build/BUILD/apache-log4j-1.2.17/target/apidocs/org/apache/log4j/lf5/LogLevelFormatException.html... Generating /builddir/build/BUILD/apache-log4j-1.2.17/target/apidocs/org/apache/log4j/lf5/LogRecord.html... Generating /builddir/build/BUILD/apache-log4j-1.2.17/target/apidocs/org/apache/log4j/lf5/LogRecordFilter.html... Generating /builddir/build/BUILD/apache-log4j-1.2.17/target/apidocs/org/apache/log4j/lf5/PassingLogRecordFilter.html... Generating /builddir/build/BUILD/apache-log4j-1.2.17/target/apidocs/org/apache/log4j/lf5/StartLogFactor5.html... Generating /builddir/build/BUILD/apache-log4j-1.2.17/target/apidocs/org/apache/log4j/net/JMSAppender.html... Generating /builddir/build/BUILD/apache-log4j-1.2.17/target/apidocs/org/apache/log4j/net/JMSSink.html... Generating /builddir/build/BUILD/apache-log4j-1.2.17/target/apidocs/org/apache/log4j/net/SimpleSocketServer.html... Generating /builddir/build/BUILD/apache-log4j-1.2.17/target/apidocs/org/apache/log4j/net/SMTPAppender.html... Generating /builddir/build/BUILD/apache-log4j-1.2.17/target/apidocs/org/apache/log4j/net/SocketAppender.html... Generating /builddir/build/BUILD/apache-log4j-1.2.17/target/apidocs/org/apache/log4j/net/SocketHubAppender.html... Generating /builddir/build/BUILD/apache-log4j-1.2.17/target/apidocs/org/apache/log4j/net/SocketNode.html... Generating /builddir/build/BUILD/apache-log4j-1.2.17/target/apidocs/org/apache/log4j/net/SocketServer.html... Generating /builddir/build/BUILD/apache-log4j-1.2.17/target/apidocs/org/apache/log4j/net/SyslogAppender.html... Generating /builddir/build/BUILD/apache-log4j-1.2.17/target/apidocs/org/apache/log4j/net/TelnetAppender.html... Generating /builddir/build/BUILD/apache-log4j-1.2.17/target/apidocs/org/apache/log4j/net/TelnetAppender.SocketHandler.html... Generating /builddir/build/BUILD/apache-log4j-1.2.17/target/apidocs/org/apache/log4j/net/ZeroConfSupport.html... Generating /builddir/build/BUILD/apache-log4j-1.2.17/target/apidocs/org/apache/log4j/rewrite/MapRewritePolicy.html... Generating /builddir/build/BUILD/apache-log4j-1.2.17/target/apidocs/org/apache/log4j/rewrite/PropertyRewritePolicy.html... Generating /builddir/build/BUILD/apache-log4j-1.2.17/target/apidocs/org/apache/log4j/rewrite/ReflectionRewritePolicy.html... Generating /builddir/build/BUILD/apache-log4j-1.2.17/target/apidocs/org/apache/log4j/rewrite/RewriteAppender.html... Generating /builddir/build/BUILD/apache-log4j-1.2.17/target/apidocs/org/apache/log4j/rewrite/RewritePolicy.html... Generating /builddir/build/BUILD/apache-log4j-1.2.17/target/apidocs/org/apache/log4j/xml/DOMConfigurator.html... Generating /builddir/build/BUILD/apache-log4j-1.2.17/target/apidocs/org/apache/log4j/xml/Log4jEntityResolver.html... Generating /builddir/build/BUILD/apache-log4j-1.2.17/target/apidocs/org/apache/log4j/xml/SAXErrorHandler.html... Generating /builddir/build/BUILD/apache-log4j-1.2.17/target/apidocs/org/apache/log4j/xml/UnrecognizedElementHandler.html... Generating /builddir/build/BUILD/apache-log4j-1.2.17/target/apidocs/org/apache/log4j/xml/XMLLayout.html... Generating /builddir/build/BUILD/apache-log4j-1.2.17/target/apidocs/org/apache/log4j/varia/DenyAllFilter.html... Generating /builddir/build/BUILD/apache-log4j-1.2.17/target/apidocs/org/apache/log4j/varia/ExternallyRolledFileAppender.html... Generating /builddir/build/BUILD/apache-log4j-1.2.17/target/apidocs/org/apache/log4j/varia/FallbackErrorHandler.html... Generating /builddir/build/BUILD/apache-log4j-1.2.17/target/apidocs/org/apache/log4j/varia/LevelMatchFilter.html... Generating /builddir/build/BUILD/apache-log4j-1.2.17/target/apidocs/org/apache/log4j/varia/LevelRangeFilter.html... Generating /builddir/build/BUILD/apache-log4j-1.2.17/target/apidocs/org/apache/log4j/varia/NullAppender.html... Generating /builddir/build/BUILD/apache-log4j-1.2.17/target/apidocs/org/apache/log4j/varia/ReloadingPropertyConfigurator.html... Generating /builddir/build/BUILD/apache-log4j-1.2.17/target/apidocs/org/apache/log4j/varia/Roller.html... Generating /builddir/build/BUILD/apache-log4j-1.2.17/target/apidocs/org/apache/log4j/varia/StringMatchFilter.html... Generating /builddir/build/BUILD/apache-log4j-1.2.17/target/apidocs/org/apache/log4j/Appender.html... Generating /builddir/build/BUILD/apache-log4j-1.2.17/target/apidocs/org/apache/log4j/AppenderSkeleton.html... Generating /builddir/build/BUILD/apache-log4j-1.2.17/target/apidocs/org/apache/log4j/AsyncAppender.html... Generating /builddir/build/BUILD/apache-log4j-1.2.17/target/apidocs/org/apache/log4j/BasicConfigurator.html... Generating /builddir/build/BUILD/apache-log4j-1.2.17/target/apidocs/org/apache/log4j/Category.html... Generating /builddir/build/BUILD/apache-log4j-1.2.17/target/apidocs/org/apache/log4j/ConsoleAppender.html... Generating /builddir/build/BUILD/apache-log4j-1.2.17/target/apidocs/org/apache/log4j/DailyRollingFileAppender.html... Generating /builddir/build/BUILD/apache-log4j-1.2.17/target/apidocs/org/apache/log4j/DefaultThrowableRenderer.html... Generating /builddir/build/BUILD/apache-log4j-1.2.17/target/apidocs/org/apache/log4j/EnhancedPatternLayout.html... Generating /builddir/build/BUILD/apache-log4j-1.2.17/target/apidocs/org/apache/log4j/EnhancedThrowableRenderer.html... Generating /builddir/build/BUILD/apache-log4j-1.2.17/target/apidocs/org/apache/log4j/FileAppender.html... Generating /builddir/build/BUILD/apache-log4j-1.2.17/target/apidocs/org/apache/log4j/FilteredObjectInputStream.html... Generating /builddir/build/BUILD/apache-log4j-1.2.17/target/apidocs/org/apache/log4j/Hierarchy.html... Generating /builddir/build/BUILD/apache-log4j-1.2.17/target/apidocs/org/apache/log4j/HTMLLayout.html... Generating /builddir/build/BUILD/apache-log4j-1.2.17/target/apidocs/org/apache/log4j/Layout.html... Generating /builddir/build/BUILD/apache-log4j-1.2.17/target/apidocs/org/apache/log4j/Level.html... Generating /builddir/build/BUILD/apache-log4j-1.2.17/target/apidocs/org/apache/log4j/Logger.html... Generating /builddir/build/BUILD/apache-log4j-1.2.17/target/apidocs/org/apache/log4j/LogManager.html... Generating /builddir/build/BUILD/apache-log4j-1.2.17/target/apidocs/org/apache/log4j/LogMF.html... Generating /builddir/build/BUILD/apache-log4j-1.2.17/target/apidocs/org/apache/log4j/LogSF.html... Generating /builddir/build/BUILD/apache-log4j-1.2.17/target/apidocs/org/apache/log4j/LogXF.html... Generating /builddir/build/BUILD/apache-log4j-1.2.17/target/apidocs/org/apache/log4j/MDC.html... Generating /builddir/build/BUILD/apache-log4j-1.2.17/target/apidocs/org/apache/log4j/NDC.html... Generating /builddir/build/BUILD/apache-log4j-1.2.17/target/apidocs/org/apache/log4j/PatternLayout.html... Generating /builddir/build/BUILD/apache-log4j-1.2.17/target/apidocs/org/apache/log4j/Priority.html... Generating /builddir/build/BUILD/apache-log4j-1.2.17/target/apidocs/org/apache/log4j/PropertyConfigurator.html... Generating /builddir/build/BUILD/apache-log4j-1.2.17/target/apidocs/org/apache/log4j/RollingFileAppender.html... Generating /builddir/build/BUILD/apache-log4j-1.2.17/target/apidocs/org/apache/log4j/SimpleLayout.html... Generating /builddir/build/BUILD/apache-log4j-1.2.17/target/apidocs/org/apache/log4j/TTCCLayout.html... Generating /builddir/build/BUILD/apache-log4j-1.2.17/target/apidocs/org/apache/log4j/WriterAppender.html... Generating /builddir/build/BUILD/apache-log4j-1.2.17/target/apidocs/org/apache/log4j/xml/examples/XMLSample.html... Generating /builddir/build/BUILD/apache-log4j-1.2.17/target/apidocs/overview-frame.html... Generating /builddir/build/BUILD/apache-log4j-1.2.17/target/apidocs/org/apache/log4j/package-frame.html... Generating /builddir/build/BUILD/apache-log4j-1.2.17/target/apidocs/org/apache/log4j/package-summary.html... Generating /builddir/build/BUILD/apache-log4j-1.2.17/target/apidocs/org/apache/log4j/package-tree.html... Generating /builddir/build/BUILD/apache-log4j-1.2.17/target/apidocs/org/apache/log4j/chainsaw/package-frame.html... Generating /builddir/build/BUILD/apache-log4j-1.2.17/target/apidocs/org/apache/log4j/chainsaw/package-summary.html... Copying file /builddir/build/BUILD/apache-log4j-1.2.17/src/main/java/org/apache/log4j/chainsaw/doc-files/screen_01.png to directory /builddir/build/BUILD/apache-log4j-1.2.17/target/apidocs/org/apache/log4j/chainsaw/doc-files... Generating /builddir/build/BUILD/apache-log4j-1.2.17/target/apidocs/org/apache/log4j/chainsaw/package-tree.html... Generating /builddir/build/BUILD/apache-log4j-1.2.17/target/apidocs/org/apache/log4j/config/package-frame.html... Generating /builddir/build/BUILD/apache-log4j-1.2.17/target/apidocs/org/apache/log4j/config/package-summary.html... Generating /builddir/build/BUILD/apache-log4j-1.2.17/target/apidocs/org/apache/log4j/config/package-tree.html... Generating /builddir/build/BUILD/apache-log4j-1.2.17/target/apidocs/org/apache/log4j/helpers/package-frame.html... Generating /builddir/build/BUILD/apache-log4j-1.2.17/target/apidocs/org/apache/log4j/helpers/package-summary.html... Generating /builddir/build/BUILD/apache-log4j-1.2.17/target/apidocs/org/apache/log4j/helpers/package-tree.html... Generating /builddir/build/BUILD/apache-log4j-1.2.17/target/apidocs/org/apache/log4j/jdbc/package-frame.html... Generating /builddir/build/BUILD/apache-log4j-1.2.17/target/apidocs/org/apache/log4j/jdbc/package-summary.html... Generating /builddir/build/BUILD/apache-log4j-1.2.17/target/apidocs/org/apache/log4j/jdbc/package-tree.html... Generating /builddir/build/BUILD/apache-log4j-1.2.17/target/apidocs/org/apache/log4j/jmx/package-frame.html... Generating /builddir/build/BUILD/apache-log4j-1.2.17/target/apidocs/org/apache/log4j/jmx/package-summary.html... Generating /builddir/build/BUILD/apache-log4j-1.2.17/target/apidocs/org/apache/log4j/jmx/package-tree.html... Generating /builddir/build/BUILD/apache-log4j-1.2.17/target/apidocs/org/apache/log4j/lf5/package-frame.html... Generating /builddir/build/BUILD/apache-log4j-1.2.17/target/apidocs/org/apache/log4j/lf5/package-summary.html... Generating /builddir/build/BUILD/apache-log4j-1.2.17/target/apidocs/org/apache/log4j/lf5/package-tree.html... Generating /builddir/build/BUILD/apache-log4j-1.2.17/target/apidocs/org/apache/log4j/lf5/util/package-frame.html... Generating /builddir/build/BUILD/apache-log4j-1.2.17/target/apidocs/org/apache/log4j/lf5/util/package-summary.html... Generating /builddir/build/BUILD/apache-log4j-1.2.17/target/apidocs/org/apache/log4j/lf5/util/package-tree.html... Generating /builddir/build/BUILD/apache-log4j-1.2.17/target/apidocs/org/apache/log4j/lf5/viewer/package-frame.html... Generating /builddir/build/BUILD/apache-log4j-1.2.17/target/apidocs/org/apache/log4j/lf5/viewer/package-summary.html... Generating /builddir/build/BUILD/apache-log4j-1.2.17/target/apidocs/org/apache/log4j/lf5/viewer/package-tree.html... Generating /builddir/build/BUILD/apache-log4j-1.2.17/target/apidocs/org/apache/log4j/lf5/viewer/categoryexplorer/package-frame.html... Generating /builddir/build/BUILD/apache-log4j-1.2.17/target/apidocs/org/apache/log4j/lf5/viewer/categoryexplorer/package-summary.html... Generating /builddir/build/BUILD/apache-log4j-1.2.17/target/apidocs/org/apache/log4j/lf5/viewer/categoryexplorer/package-tree.html... Generating /builddir/build/BUILD/apache-log4j-1.2.17/target/apidocs/org/apache/log4j/lf5/viewer/configure/package-frame.html... Generating /builddir/build/BUILD/apache-log4j-1.2.17/target/apidocs/org/apache/log4j/lf5/viewer/configure/package-summary.html... Generating /builddir/build/BUILD/apache-log4j-1.2.17/target/apidocs/org/apache/log4j/lf5/viewer/configure/package-tree.html... Generating /builddir/build/BUILD/apache-log4j-1.2.17/target/apidocs/org/apache/log4j/net/package-frame.html... Generating /builddir/build/BUILD/apache-log4j-1.2.17/target/apidocs/org/apache/log4j/net/package-summary.html... Generating /builddir/build/BUILD/apache-log4j-1.2.17/target/apidocs/org/apache/log4j/net/package-tree.html... Generating /builddir/build/BUILD/apache-log4j-1.2.17/target/apidocs/org/apache/log4j/nt/package-frame.html... Generating /builddir/build/BUILD/apache-log4j-1.2.17/target/apidocs/org/apache/log4j/nt/package-summary.html... Generating /builddir/build/BUILD/apache-log4j-1.2.17/target/apidocs/org/apache/log4j/nt/package-tree.html... Generating /builddir/build/BUILD/apache-log4j-1.2.17/target/apidocs/org/apache/log4j/or/package-frame.html... Generating /builddir/build/BUILD/apache-log4j-1.2.17/target/apidocs/org/apache/log4j/or/package-summary.html... Generating /builddir/build/BUILD/apache-log4j-1.2.17/target/apidocs/org/apache/log4j/or/package-tree.html... Generating /builddir/build/BUILD/apache-log4j-1.2.17/target/apidocs/org/apache/log4j/or/jms/package-frame.html... Generating /builddir/build/BUILD/apache-log4j-1.2.17/target/apidocs/org/apache/log4j/or/jms/package-summary.html... Generating /builddir/build/BUILD/apache-log4j-1.2.17/target/apidocs/org/apache/log4j/or/jms/package-tree.html... Generating /builddir/build/BUILD/apache-log4j-1.2.17/target/apidocs/org/apache/log4j/or/sax/package-frame.html... Generating /builddir/build/BUILD/apache-log4j-1.2.17/target/apidocs/org/apache/log4j/or/sax/package-summary.html... Generating /builddir/build/BUILD/apache-log4j-1.2.17/target/apidocs/org/apache/log4j/or/sax/package-tree.html... Generating /builddir/build/BUILD/apache-log4j-1.2.17/target/apidocs/org/apache/log4j/pattern/package-frame.html... Generating /builddir/build/BUILD/apache-log4j-1.2.17/target/apidocs/org/apache/log4j/pattern/package-summary.html... Generating /builddir/build/BUILD/apache-log4j-1.2.17/target/apidocs/org/apache/log4j/pattern/package-tree.html... Generating /builddir/build/BUILD/apache-log4j-1.2.17/target/apidocs/org/apache/log4j/rewrite/package-frame.html... Generating /builddir/build/BUILD/apache-log4j-1.2.17/target/apidocs/org/apache/log4j/rewrite/package-summary.html... Generating /builddir/build/BUILD/apache-log4j-1.2.17/target/apidocs/org/apache/log4j/rewrite/package-tree.html... Generating /builddir/build/BUILD/apache-log4j-1.2.17/target/apidocs/org/apache/log4j/spi/package-frame.html... Generating /builddir/build/BUILD/apache-log4j-1.2.17/target/apidocs/org/apache/log4j/spi/package-summary.html... Generating /builddir/build/BUILD/apache-log4j-1.2.17/target/apidocs/org/apache/log4j/spi/package-tree.html... Generating /builddir/build/BUILD/apache-log4j-1.2.17/target/apidocs/org/apache/log4j/varia/package-frame.html... Generating /builddir/build/BUILD/apache-log4j-1.2.17/target/apidocs/org/apache/log4j/varia/package-summary.html... Generating /builddir/build/BUILD/apache-log4j-1.2.17/target/apidocs/org/apache/log4j/varia/package-tree.html... Generating /builddir/build/BUILD/apache-log4j-1.2.17/target/apidocs/org/apache/log4j/xml/package-frame.html... Generating /builddir/build/BUILD/apache-log4j-1.2.17/target/apidocs/org/apache/log4j/xml/package-summary.html... Copying file /builddir/build/BUILD/apache-log4j-1.2.17/src/main/javadoc/org/apache/log4j/xml/doc-files/log4j.dtd to directory /builddir/build/BUILD/apache-log4j-1.2.17/target/apidocs/org/apache/log4j/xml/doc-files... Generating /builddir/build/BUILD/apache-log4j-1.2.17/target/apidocs/org/apache/log4j/xml/package-tree.html... Generating /builddir/build/BUILD/apache-log4j-1.2.17/target/apidocs/org/apache/log4j/xml/examples/package-frame.html... Generating /builddir/build/BUILD/apache-log4j-1.2.17/target/apidocs/org/apache/log4j/xml/examples/package-summary.html... Copying file /builddir/build/BUILD/apache-log4j-1.2.17/src/main/javadoc/org/apache/log4j/xml/examples/doc-files/XMLSample.java to directory /builddir/build/BUILD/apache-log4j-1.2.17/target/apidocs/org/apache/log4j/xml/examples/doc-files... Copying file /builddir/build/BUILD/apache-log4j-1.2.17/src/main/javadoc/org/apache/log4j/xml/examples/doc-files/sample2.xml to directory /builddir/build/BUILD/apache-log4j-1.2.17/target/apidocs/org/apache/log4j/xml/examples/doc-files... Copying file /builddir/build/BUILD/apache-log4j-1.2.17/src/main/javadoc/org/apache/log4j/xml/examples/doc-files/sample5.xml to directory /builddir/build/BUILD/apache-log4j-1.2.17/target/apidocs/org/apache/log4j/xml/examples/doc-files... Copying file /builddir/build/BUILD/apache-log4j-1.2.17/src/main/javadoc/org/apache/log4j/xml/examples/doc-files/sample1.xml to directory /builddir/build/BUILD/apache-log4j-1.2.17/target/apidocs/org/apache/log4j/xml/examples/doc-files... Copying file /builddir/build/BUILD/apache-log4j-1.2.17/src/main/javadoc/org/apache/log4j/xml/examples/doc-files/sample4.xml to directory /builddir/build/BUILD/apache-log4j-1.2.17/target/apidocs/org/apache/log4j/xml/examples/doc-files... Copying file /builddir/build/BUILD/apache-log4j-1.2.17/src/main/javadoc/org/apache/log4j/xml/examples/doc-files/sample3.xml to directory /builddir/build/BUILD/apache-log4j-1.2.17/target/apidocs/org/apache/log4j/xml/examples/doc-files... Generating /builddir/build/BUILD/apache-log4j-1.2.17/target/apidocs/org/apache/log4j/xml/examples/package-tree.html... Generating /builddir/build/BUILD/apache-log4j-1.2.17/target/apidocs/constant-values.html... Generating /builddir/build/BUILD/apache-log4j-1.2.17/target/apidocs/serialized-form.html... Generating /builddir/build/BUILD/apache-log4j-1.2.17/target/apidocs/org/apache/log4j/pattern/class-use/LineSeparatorPatternConverter.html... Generating /builddir/build/BUILD/apache-log4j-1.2.17/target/apidocs/org/apache/log4j/pattern/class-use/ThreadPatternConverter.html... Generating /builddir/build/BUILD/apache-log4j-1.2.17/target/apidocs/org/apache/log4j/pattern/class-use/LevelPatternConverter.html... Generating /builddir/build/BUILD/apache-log4j-1.2.17/target/apidocs/org/apache/log4j/pattern/class-use/RelativeTimePatternConverter.html... Generating /builddir/build/BUILD/apache-log4j-1.2.17/target/apidocs/org/apache/log4j/pattern/class-use/SequenceNumberPatternConverter.html... Generating /builddir/build/BUILD/apache-log4j-1.2.17/target/apidocs/org/apache/log4j/pattern/class-use/LogEvent.html... Generating /builddir/build/BUILD/apache-log4j-1.2.17/target/apidocs/org/apache/log4j/pattern/class-use/FileDatePatternConverter.html... Generating /builddir/build/BUILD/apache-log4j-1.2.17/target/apidocs/org/apache/log4j/pattern/class-use/ThrowableInformationPatternConverter.html... Generating /builddir/build/BUILD/apache-log4j-1.2.17/target/apidocs/org/apache/log4j/pattern/class-use/MessagePatternConverter.html... Generating /builddir/build/BUILD/apache-log4j-1.2.17/target/apidocs/org/apache/log4j/pattern/class-use/LiteralPatternConverter.html... Generating /builddir/build/BUILD/apache-log4j-1.2.17/target/apidocs/org/apache/log4j/pattern/class-use/BridgePatternParser.html... Generating /builddir/build/BUILD/apache-log4j-1.2.17/target/apidocs/org/apache/log4j/pattern/class-use/FileLocationPatternConverter.html... Generating /builddir/build/BUILD/apache-log4j-1.2.17/target/apidocs/org/apache/log4j/pattern/class-use/MethodLocationPatternConverter.html... Generating /builddir/build/BUILD/apache-log4j-1.2.17/target/apidocs/org/apache/log4j/pattern/class-use/BridgePatternConverter.html... Generating /builddir/build/BUILD/apache-log4j-1.2.17/target/apidocs/org/apache/log4j/pattern/class-use/PropertiesPatternConverter.html... Generating /builddir/build/BUILD/apache-log4j-1.2.17/target/apidocs/org/apache/log4j/pattern/class-use/LineLocationPatternConverter.html... Generating /builddir/build/BUILD/apache-log4j-1.2.17/target/apidocs/org/apache/log4j/pattern/class-use/DatePatternConverter.html... Generating /builddir/build/BUILD/apache-log4j-1.2.17/target/apidocs/org/apache/log4j/pattern/class-use/NDCPatternConverter.html... Generating /builddir/build/BUILD/apache-log4j-1.2.17/target/apidocs/org/apache/log4j/pattern/class-use/IntegerPatternConverter.html... Generating /builddir/build/BUILD/apache-log4j-1.2.17/target/apidocs/org/apache/log4j/pattern/class-use/FormattingInfo.html... Generating /builddir/build/BUILD/apache-log4j-1.2.17/target/apidocs/org/apache/log4j/pattern/class-use/PatternParser.html... Generating /builddir/build/BUILD/apache-log4j-1.2.17/target/apidocs/org/apache/log4j/pattern/class-use/ClassNamePatternConverter.html... Generating /builddir/build/BUILD/apache-log4j-1.2.17/target/apidocs/org/apache/log4j/pattern/class-use/CachedDateFormat.html... Generating /builddir/build/BUILD/apache-log4j-1.2.17/target/apidocs/org/apache/log4j/pattern/class-use/NameAbbreviator.html... Generating /builddir/build/BUILD/apache-log4j-1.2.17/target/apidocs/org/apache/log4j/pattern/class-use/NamePatternConverter.html... Generating /builddir/build/BUILD/apache-log4j-1.2.17/target/apidocs/org/apache/log4j/pattern/class-use/LoggerPatternConverter.html... Generating /builddir/build/BUILD/apache-log4j-1.2.17/target/apidocs/org/apache/log4j/pattern/class-use/PatternConverter.html... Generating /builddir/build/BUILD/apache-log4j-1.2.17/target/apidocs/org/apache/log4j/pattern/class-use/LoggingEventPatternConverter.html... Generating /builddir/build/BUILD/apache-log4j-1.2.17/target/apidocs/org/apache/log4j/pattern/class-use/FullLocationPatternConverter.html... Generating /builddir/build/BUILD/apache-log4j-1.2.17/target/apidocs/org/apache/log4j/helpers/class-use/NullEnumeration.html... Generating /builddir/build/BUILD/apache-log4j-1.2.17/target/apidocs/org/apache/log4j/helpers/class-use/OptionConverter.html... Generating /builddir/build/BUILD/apache-log4j-1.2.17/target/apidocs/org/apache/log4j/helpers/class-use/SyslogWriter.html... Generating /builddir/build/BUILD/apache-log4j-1.2.17/target/apidocs/org/apache/log4j/helpers/class-use/LogLog.html... Generating /builddir/build/BUILD/apache-log4j-1.2.17/target/apidocs/org/apache/log4j/helpers/class-use/ThreadLocalMap.html... Generating /builddir/build/BUILD/apache-log4j-1.2.17/target/apidocs/org/apache/log4j/helpers/class-use/UtilLoggingLevel.html... Generating /builddir/build/BUILD/apache-log4j-1.2.17/target/apidocs/org/apache/log4j/helpers/class-use/MDCKeySetExtractor.html... Generating /builddir/build/BUILD/apache-log4j-1.2.17/target/apidocs/org/apache/log4j/helpers/class-use/CyclicBuffer.html... Generating /builddir/build/BUILD/apache-log4j-1.2.17/target/apidocs/org/apache/log4j/helpers/class-use/OnlyOnceErrorHandler.html... Generating /builddir/build/BUILD/apache-log4j-1.2.17/target/apidocs/org/apache/log4j/helpers/class-use/SyslogQuietWriter.html... Generating /builddir/build/BUILD/apache-log4j-1.2.17/target/apidocs/org/apache/log4j/helpers/class-use/PatternParser.html... Generating /builddir/build/BUILD/apache-log4j-1.2.17/target/apidocs/org/apache/log4j/helpers/class-use/PatternConverter.html... Generating /builddir/build/BUILD/apache-log4j-1.2.17/target/apidocs/org/apache/log4j/helpers/class-use/Loader.html... Generating /builddir/build/BUILD/apache-log4j-1.2.17/target/apidocs/org/apache/log4j/helpers/class-use/CountingQuietWriter.html... Generating /builddir/build/BUILD/apache-log4j-1.2.17/target/apidocs/org/apache/log4j/helpers/class-use/RelativeTimeDateFormat.html... Generating /builddir/build/BUILD/apache-log4j-1.2.17/target/apidocs/org/apache/log4j/helpers/class-use/FileWatchdog.html... Generating /builddir/build/BUILD/apache-log4j-1.2.17/target/apidocs/org/apache/log4j/helpers/class-use/FormattingInfo.html... Generating /builddir/build/BUILD/apache-log4j-1.2.17/target/apidocs/org/apache/log4j/helpers/class-use/ISO8601DateFormat.html... Generating /builddir/build/BUILD/apache-log4j-1.2.17/target/apidocs/org/apache/log4j/helpers/class-use/AbsoluteTimeDateFormat.html... Generating /builddir/build/BUILD/apache-log4j-1.2.17/target/apidocs/org/apache/log4j/helpers/class-use/DateTimeDateFormat.html... Generating /builddir/build/BUILD/apache-log4j-1.2.17/target/apidocs/org/apache/log4j/helpers/class-use/Transform.html... Generating /builddir/build/BUILD/apache-log4j-1.2.17/target/apidocs/org/apache/log4j/helpers/class-use/BoundedFIFO.html... Generating /builddir/build/BUILD/apache-log4j-1.2.17/target/apidocs/org/apache/log4j/helpers/class-use/DateLayout.html... Generating /builddir/build/BUILD/apache-log4j-1.2.17/target/apidocs/org/apache/log4j/helpers/class-use/QuietWriter.html... Generating /builddir/build/BUILD/apache-log4j-1.2.17/target/apidocs/org/apache/log4j/helpers/class-use/AppenderAttachableImpl.html... Generating /builddir/build/BUILD/apache-log4j-1.2.17/target/apidocs/org/apache/log4j/or/jms/class-use/MessageRenderer.html... Generating /builddir/build/BUILD/apache-log4j-1.2.17/target/apidocs/org/apache/log4j/or/sax/class-use/AttributesRenderer.html... Generating /builddir/build/BUILD/apache-log4j-1.2.17/target/apidocs/org/apache/log4j/or/class-use/ThreadGroupRenderer.html... Generating /builddir/build/BUILD/apache-log4j-1.2.17/target/apidocs/org/apache/log4j/or/class-use/ObjectRenderer.html... Generating /builddir/build/BUILD/apache-log4j-1.2.17/target/apidocs/org/apache/log4j/or/class-use/RendererMap.html... Generating /builddir/build/BUILD/apache-log4j-1.2.17/target/apidocs/org/apache/log4j/jdbc/class-use/JDBCAppender.html... Generating /builddir/build/BUILD/apache-log4j-1.2.17/target/apidocs/org/apache/log4j/config/class-use/PropertyGetter.html... Generating /builddir/build/BUILD/apache-log4j-1.2.17/target/apidocs/org/apache/log4j/config/class-use/PropertyGetter.PropertyCallback.html... Generating /builddir/build/BUILD/apache-log4j-1.2.17/target/apidocs/org/apache/log4j/config/class-use/PropertyPrinter.html... Generating /builddir/build/BUILD/apache-log4j-1.2.17/target/apidocs/org/apache/log4j/config/class-use/PropertySetterException.html... Generating /builddir/build/BUILD/apache-log4j-1.2.17/target/apidocs/org/apache/log4j/config/class-use/PropertySetter.html... Generating /builddir/build/BUILD/apache-log4j-1.2.17/target/apidocs/org/apache/log4j/chainsaw/class-use/Main.html... Generating /builddir/build/BUILD/apache-log4j-1.2.17/target/apidocs/org/apache/log4j/jmx/class-use/AppenderDynamicMBean.html... Generating /builddir/build/BUILD/apache-log4j-1.2.17/target/apidocs/org/apache/log4j/jmx/class-use/HierarchyDynamicMBean.html... Generating /builddir/build/BUILD/apache-log4j-1.2.17/target/apidocs/org/apache/log4j/jmx/class-use/LayoutDynamicMBean.html... Generating /builddir/build/BUILD/apache-log4j-1.2.17/target/apidocs/org/apache/log4j/jmx/class-use/AbstractDynamicMBean.html... Generating /builddir/build/BUILD/apache-log4j-1.2.17/target/apidocs/org/apache/log4j/jmx/class-use/LoggerDynamicMBean.html... Generating /builddir/build/BUILD/apache-log4j-1.2.17/target/apidocs/org/apache/log4j/jmx/class-use/Agent.html... Generating /builddir/build/BUILD/apache-log4j-1.2.17/target/apidocs/org/apache/log4j/nt/class-use/NTEventLogAppender.html... Generating /builddir/build/BUILD/apache-log4j-1.2.17/target/apidocs/org/apache/log4j/spi/class-use/NOPLogger.html... Generating /builddir/build/BUILD/apache-log4j-1.2.17/target/apidocs/org/apache/log4j/spi/class-use/NOPLoggerRepository.html... Generating /builddir/build/BUILD/apache-log4j-1.2.17/target/apidocs/org/apache/log4j/spi/class-use/RootCategory.html... Generating /builddir/build/BUILD/apache-log4j-1.2.17/target/apidocs/org/apache/log4j/spi/class-use/ThrowableRendererSupport.html... Generating /builddir/build/BUILD/apache-log4j-1.2.17/target/apidocs/org/apache/log4j/spi/class-use/ErrorCode.html... Generating /builddir/build/BUILD/apache-log4j-1.2.17/target/apidocs/org/apache/log4j/spi/class-use/RootLogger.html... Generating /builddir/build/BUILD/apache-log4j-1.2.17/target/apidocs/org/apache/log4j/spi/class-use/TriggeringEventEvaluator.html... Generating /builddir/build/BUILD/apache-log4j-1.2.17/target/apidocs/org/apache/log4j/spi/class-use/RepositorySelector.html... Generating /builddir/build/BUILD/apache-log4j-1.2.17/target/apidocs/org/apache/log4j/spi/class-use/DefaultRepositorySelector.html... Generating /builddir/build/BUILD/apache-log4j-1.2.17/target/apidocs/org/apache/log4j/spi/class-use/ThrowableRenderer.html... Generating /builddir/build/BUILD/apache-log4j-1.2.17/target/apidocs/org/apache/log4j/spi/class-use/Configurator.html... Generating /builddir/build/BUILD/apache-log4j-1.2.17/target/apidocs/org/apache/log4j/spi/class-use/RendererSupport.html... Generating /builddir/build/BUILD/apache-log4j-1.2.17/target/apidocs/org/apache/log4j/spi/class-use/ErrorHandler.html... Generating /builddir/build/BUILD/apache-log4j-1.2.17/target/apidocs/org/apache/log4j/spi/class-use/OptionHandler.html... Generating /builddir/build/BUILD/apache-log4j-1.2.17/target/apidocs/org/apache/log4j/spi/class-use/Filter.html... Generating /builddir/build/BUILD/apache-log4j-1.2.17/target/apidocs/org/apache/log4j/spi/class-use/LoggerFactory.html... Generating /builddir/build/BUILD/apache-log4j-1.2.17/target/apidocs/org/apache/log4j/spi/class-use/HierarchyEventListener.html... Generating /builddir/build/BUILD/apache-log4j-1.2.17/target/apidocs/org/apache/log4j/spi/class-use/LoggerRepository.html... Generating /builddir/build/BUILD/apache-log4j-1.2.17/target/apidocs/org/apache/log4j/spi/class-use/LocationInfo.html... Generating /builddir/build/BUILD/apache-log4j-1.2.17/target/apidocs/org/apache/log4j/spi/class-use/ThrowableInformation.html... Generating /builddir/build/BUILD/apache-log4j-1.2.17/target/apidocs/org/apache/log4j/spi/class-use/AppenderAttachable.html... Generating /builddir/build/BUILD/apache-log4j-1.2.17/target/apidocs/org/apache/log4j/spi/class-use/LoggingEvent.html... Generating /builddir/build/BUILD/apache-log4j-1.2.17/target/apidocs/org/apache/log4j/lf5/util/class-use/StreamUtils.html... Generating /builddir/build/BUILD/apache-log4j-1.2.17/target/apidocs/org/apache/log4j/lf5/util/class-use/LogFileParser.html... Generating /builddir/build/BUILD/apache-log4j-1.2.17/target/apidocs/org/apache/log4j/lf5/util/class-use/AdapterLogRecord.html... Generating /builddir/build/BUILD/apache-log4j-1.2.17/target/apidocs/org/apache/log4j/lf5/util/class-use/LogMonitorAdapter.html... Generating /builddir/build/BUILD/apache-log4j-1.2.17/target/apidocs/org/apache/log4j/lf5/util/class-use/Resource.html... Generating /builddir/build/BUILD/apache-log4j-1.2.17/target/apidocs/org/apache/log4j/lf5/util/class-use/ResourceUtils.html... Generating /builddir/build/BUILD/apache-log4j-1.2.17/target/apidocs/org/apache/log4j/lf5/util/class-use/DateFormatManager.html... Generating /builddir/build/BUILD/apache-log4j-1.2.17/target/apidocs/org/apache/log4j/lf5/viewer/configure/class-use/MRUFileManager.html... Generating /builddir/build/BUILD/apache-log4j-1.2.17/target/apidocs/org/apache/log4j/lf5/viewer/configure/class-use/ConfigurationManager.html... Generating /builddir/build/BUILD/apache-log4j-1.2.17/target/apidocs/org/apache/log4j/lf5/viewer/categoryexplorer/class-use/CategoryImmediateEditor.html... Generating /builddir/build/BUILD/apache-log4j-1.2.17/target/apidocs/org/apache/log4j/lf5/viewer/categoryexplorer/class-use/TreeModelAdapter.html... Generating /builddir/build/BUILD/apache-log4j-1.2.17/target/apidocs/org/apache/log4j/lf5/viewer/categoryexplorer/class-use/CategoryExplorerTree.html... Generating /builddir/build/BUILD/apache-log4j-1.2.17/target/apidocs/org/apache/log4j/lf5/viewer/categoryexplorer/class-use/CategoryNodeRenderer.html... Generating /builddir/build/BUILD/apache-log4j-1.2.17/target/apidocs/org/apache/log4j/lf5/viewer/categoryexplorer/class-use/CategoryNodeEditorRenderer.html... Generating /builddir/build/BUILD/apache-log4j-1.2.17/target/apidocs/org/apache/log4j/lf5/viewer/categoryexplorer/class-use/CategoryAbstractCellEditor.html... Generating /builddir/build/BUILD/apache-log4j-1.2.17/target/apidocs/org/apache/log4j/lf5/viewer/categoryexplorer/class-use/CategoryNodeEditor.html... Generating /builddir/build/BUILD/apache-log4j-1.2.17/target/apidocs/org/apache/log4j/lf5/viewer/categoryexplorer/class-use/CategoryExplorerModel.html... Generating /builddir/build/BUILD/apache-log4j-1.2.17/target/apidocs/org/apache/log4j/lf5/viewer/categoryexplorer/class-use/CategoryExplorerLogRecordFilter.html... Generating /builddir/build/BUILD/apache-log4j-1.2.17/target/apidocs/org/apache/log4j/lf5/viewer/categoryexplorer/class-use/CategoryElement.html... Generating /builddir/build/BUILD/apache-log4j-1.2.17/target/apidocs/org/apache/log4j/lf5/viewer/categoryexplorer/class-use/CategoryPath.html... Generating /builddir/build/BUILD/apache-log4j-1.2.17/target/apidocs/org/apache/log4j/lf5/viewer/categoryexplorer/class-use/CategoryNode.html... Generating /builddir/build/BUILD/apache-log4j-1.2.17/target/apidocs/org/apache/log4j/lf5/viewer/class-use/LogFactor5ErrorDialog.html... Generating /builddir/build/BUILD/apache-log4j-1.2.17/target/apidocs/org/apache/log4j/lf5/viewer/class-use/LF5SwingUtils.html... Generating /builddir/build/BUILD/apache-log4j-1.2.17/target/apidocs/org/apache/log4j/lf5/viewer/class-use/LogFactor5InputDialog.html... Generating /builddir/build/BUILD/apache-log4j-1.2.17/target/apidocs/org/apache/log4j/lf5/viewer/class-use/LogFactor5LoadingDialog.html... Generating /builddir/build/BUILD/apache-log4j-1.2.17/target/apidocs/org/apache/log4j/lf5/viewer/class-use/LogTableModel.html... Generating /builddir/build/BUILD/apache-log4j-1.2.17/target/apidocs/org/apache/log4j/lf5/viewer/class-use/LogFactor5Dialog.html... Generating /builddir/build/BUILD/apache-log4j-1.2.17/target/apidocs/org/apache/log4j/lf5/viewer/class-use/LogTableColumnFormatException.html... Generating /builddir/build/BUILD/apache-log4j-1.2.17/target/apidocs/org/apache/log4j/lf5/viewer/class-use/FilteredLogTableModel.html... Generating /builddir/build/BUILD/apache-log4j-1.2.17/target/apidocs/org/apache/log4j/lf5/viewer/class-use/LogTableColumn.html... Generating /builddir/build/BUILD/apache-log4j-1.2.17/target/apidocs/org/apache/log4j/lf5/viewer/class-use/LogTable.html... Generating /builddir/build/BUILD/apache-log4j-1.2.17/target/apidocs/org/apache/log4j/lf5/viewer/class-use/LogBrokerMonitor.html... Generating /builddir/build/BUILD/apache-log4j-1.2.17/target/apidocs/org/apache/log4j/lf5/viewer/class-use/TrackingAdjustmentListener.html... Generating /builddir/build/BUILD/apache-log4j-1.2.17/target/apidocs/org/apache/log4j/lf5/viewer/class-use/LogTableRowRenderer.html... Generating /builddir/build/BUILD/apache-log4j-1.2.17/target/apidocs/org/apache/log4j/lf5/class-use/DefaultLF5Configurator.html... Generating /builddir/build/BUILD/apache-log4j-1.2.17/target/apidocs/org/apache/log4j/lf5/class-use/PassingLogRecordFilter.html... Generating /builddir/build/BUILD/apache-log4j-1.2.17/target/apidocs/org/apache/log4j/lf5/class-use/Log4JLogRecord.html... Generating /builddir/build/BUILD/apache-log4j-1.2.17/target/apidocs/org/apache/log4j/lf5/class-use/StartLogFactor5.html... Generating /builddir/build/BUILD/apache-log4j-1.2.17/target/apidocs/org/apache/log4j/lf5/class-use/AppenderFinalizer.html... Generating /builddir/build/BUILD/apache-log4j-1.2.17/target/apidocs/org/apache/log4j/lf5/class-use/LF5Appender.html... Generating /builddir/build/BUILD/apache-log4j-1.2.17/target/apidocs/org/apache/log4j/lf5/class-use/LogLevelFormatException.html... Generating /builddir/build/BUILD/apache-log4j-1.2.17/target/apidocs/org/apache/log4j/lf5/class-use/LogLevel.html... Generating /builddir/build/BUILD/apache-log4j-1.2.17/target/apidocs/org/apache/log4j/lf5/class-use/LogRecord.html... Generating /builddir/build/BUILD/apache-log4j-1.2.17/target/apidocs/org/apache/log4j/lf5/class-use/LogRecordFilter.html... Generating /builddir/build/BUILD/apache-log4j-1.2.17/target/apidocs/org/apache/log4j/net/class-use/SocketServer.html... Generating /builddir/build/BUILD/apache-log4j-1.2.17/target/apidocs/org/apache/log4j/net/class-use/SimpleSocketServer.html... Generating /builddir/build/BUILD/apache-log4j-1.2.17/target/apidocs/org/apache/log4j/net/class-use/SocketHubAppender.html... Generating /builddir/build/BUILD/apache-log4j-1.2.17/target/apidocs/org/apache/log4j/net/class-use/SocketAppender.html... Generating /builddir/build/BUILD/apache-log4j-1.2.17/target/apidocs/org/apache/log4j/net/class-use/SMTPAppender.html... Generating /builddir/build/BUILD/apache-log4j-1.2.17/target/apidocs/org/apache/log4j/net/class-use/TelnetAppender.html... Generating /builddir/build/BUILD/apache-log4j-1.2.17/target/apidocs/org/apache/log4j/net/class-use/TelnetAppender.SocketHandler.html... Generating /builddir/build/BUILD/apache-log4j-1.2.17/target/apidocs/org/apache/log4j/net/class-use/JMSAppender.html... Generating /builddir/build/BUILD/apache-log4j-1.2.17/target/apidocs/org/apache/log4j/net/class-use/SocketNode.html... Generating /builddir/build/BUILD/apache-log4j-1.2.17/target/apidocs/org/apache/log4j/net/class-use/SyslogAppender.html... Generating /builddir/build/BUILD/apache-log4j-1.2.17/target/apidocs/org/apache/log4j/net/class-use/ZeroConfSupport.html... Generating /builddir/build/BUILD/apache-log4j-1.2.17/target/apidocs/org/apache/log4j/net/class-use/JMSSink.html... Generating /builddir/build/BUILD/apache-log4j-1.2.17/target/apidocs/org/apache/log4j/rewrite/class-use/ReflectionRewritePolicy.html... Generating /builddir/build/BUILD/apache-log4j-1.2.17/target/apidocs/org/apache/log4j/rewrite/class-use/PropertyRewritePolicy.html... Generating /builddir/build/BUILD/apache-log4j-1.2.17/target/apidocs/org/apache/log4j/rewrite/class-use/MapRewritePolicy.html... Generating /builddir/build/BUILD/apache-log4j-1.2.17/target/apidocs/org/apache/log4j/rewrite/class-use/RewritePolicy.html... Generating /builddir/build/BUILD/apache-log4j-1.2.17/target/apidocs/org/apache/log4j/rewrite/class-use/RewriteAppender.html... Generating /builddir/build/BUILD/apache-log4j-1.2.17/target/apidocs/org/apache/log4j/xml/class-use/SAXErrorHandler.html... Generating /builddir/build/BUILD/apache-log4j-1.2.17/target/apidocs/org/apache/log4j/xml/class-use/Log4jEntityResolver.html... Generating /builddir/build/BUILD/apache-log4j-1.2.17/target/apidocs/org/apache/log4j/xml/class-use/DOMConfigurator.html... Generating /builddir/build/BUILD/apache-log4j-1.2.17/target/apidocs/org/apache/log4j/xml/class-use/XMLLayout.html... Generating /builddir/build/BUILD/apache-log4j-1.2.17/target/apidocs/org/apache/log4j/xml/class-use/UnrecognizedElementHandler.html... Generating /builddir/build/BUILD/apache-log4j-1.2.17/target/apidocs/org/apache/log4j/varia/class-use/LevelRangeFilter.html... Generating /builddir/build/BUILD/apache-log4j-1.2.17/target/apidocs/org/apache/log4j/varia/class-use/Roller.html... Generating /builddir/build/BUILD/apache-log4j-1.2.17/target/apidocs/org/apache/log4j/varia/class-use/ReloadingPropertyConfigurator.html... Generating /builddir/build/BUILD/apache-log4j-1.2.17/target/apidocs/org/apache/log4j/varia/class-use/ExternallyRolledFileAppender.html... Generating /builddir/build/BUILD/apache-log4j-1.2.17/target/apidocs/org/apache/log4j/varia/class-use/StringMatchFilter.html... Generating /builddir/build/BUILD/apache-log4j-1.2.17/target/apidocs/org/apache/log4j/varia/class-use/FallbackErrorHandler.html... Generating /builddir/build/BUILD/apache-log4j-1.2.17/target/apidocs/org/apache/log4j/varia/class-use/DenyAllFilter.html... Generating /builddir/build/BUILD/apache-log4j-1.2.17/target/apidocs/org/apache/log4j/varia/class-use/NullAppender.html... Generating /builddir/build/BUILD/apache-log4j-1.2.17/target/apidocs/org/apache/log4j/varia/class-use/LevelMatchFilter.html... Generating /builddir/build/BUILD/apache-log4j-1.2.17/target/apidocs/org/apache/log4j/class-use/LogManager.html... Generating /builddir/build/BUILD/apache-log4j-1.2.17/target/apidocs/org/apache/log4j/class-use/DailyRollingFileAppender.html... Generating /builddir/build/BUILD/apache-log4j-1.2.17/target/apidocs/org/apache/log4j/class-use/ConsoleAppender.html... Generating /builddir/build/BUILD/apache-log4j-1.2.17/target/apidocs/org/apache/log4j/class-use/FilteredObjectInputStream.html... Generating /builddir/build/BUILD/apache-log4j-1.2.17/target/apidocs/org/apache/log4j/class-use/Hierarchy.html... Generating /builddir/build/BUILD/apache-log4j-1.2.17/target/apidocs/org/apache/log4j/class-use/MDC.html... Generating /builddir/build/BUILD/apache-log4j-1.2.17/target/apidocs/org/apache/log4j/class-use/DefaultThrowableRenderer.html... Generating /builddir/build/BUILD/apache-log4j-1.2.17/target/apidocs/org/apache/log4j/class-use/PatternLayout.html... Generating /builddir/build/BUILD/apache-log4j-1.2.17/target/apidocs/org/apache/log4j/class-use/PropertyConfigurator.html... Generating /builddir/build/BUILD/apache-log4j-1.2.17/target/apidocs/org/apache/log4j/class-use/NDC.html... Generating /builddir/build/BUILD/apache-log4j-1.2.17/target/apidocs/org/apache/log4j/class-use/LogSF.html... Generating /builddir/build/BUILD/apache-log4j-1.2.17/target/apidocs/org/apache/log4j/class-use/SimpleLayout.html... Generating /builddir/build/BUILD/apache-log4j-1.2.17/target/apidocs/org/apache/log4j/class-use/EnhancedThrowableRenderer.html... Generating /builddir/build/BUILD/apache-log4j-1.2.17/target/apidocs/org/apache/log4j/class-use/RollingFileAppender.html... Generating /builddir/build/BUILD/apache-log4j-1.2.17/target/apidocs/org/apache/log4j/class-use/EnhancedPatternLayout.html... Generating /builddir/build/BUILD/apache-log4j-1.2.17/target/apidocs/org/apache/log4j/class-use/BasicConfigurator.html... Generating /builddir/build/BUILD/apache-log4j-1.2.17/target/apidocs/org/apache/log4j/class-use/AsyncAppender.html... Generating /builddir/build/BUILD/apache-log4j-1.2.17/target/apidocs/org/apache/log4j/class-use/WriterAppender.html... Generating /builddir/build/BUILD/apache-log4j-1.2.17/target/apidocs/org/apache/log4j/class-use/FileAppender.html... Generating /builddir/build/BUILD/apache-log4j-1.2.17/target/apidocs/org/apache/log4j/class-use/HTMLLayout.html... Generating /builddir/build/BUILD/apache-log4j-1.2.17/target/apidocs/org/apache/log4j/class-use/TTCCLayout.html... Generating /builddir/build/BUILD/apache-log4j-1.2.17/target/apidocs/org/apache/log4j/class-use/AppenderSkeleton.html... Generating /builddir/build/BUILD/apache-log4j-1.2.17/target/apidocs/org/apache/log4j/class-use/LogMF.html... Generating /builddir/build/BUILD/apache-log4j-1.2.17/target/apidocs/org/apache/log4j/class-use/LogXF.html... Generating /builddir/build/BUILD/apache-log4j-1.2.17/target/apidocs/org/apache/log4j/class-use/Layout.html... Generating /builddir/build/BUILD/apache-log4j-1.2.17/target/apidocs/org/apache/log4j/class-use/Logger.html... Generating /builddir/build/BUILD/apache-log4j-1.2.17/target/apidocs/org/apache/log4j/class-use/Appender.html... Generating /builddir/build/BUILD/apache-log4j-1.2.17/target/apidocs/org/apache/log4j/class-use/Level.html... Generating /builddir/build/BUILD/apache-log4j-1.2.17/target/apidocs/org/apache/log4j/class-use/Priority.html... Generating /builddir/build/BUILD/apache-log4j-1.2.17/target/apidocs/org/apache/log4j/class-use/Category.html... Generating /builddir/build/BUILD/apache-log4j-1.2.17/target/apidocs/org/apache/log4j/xml/examples/class-use/XMLSample.html... Generating /builddir/build/BUILD/apache-log4j-1.2.17/target/apidocs/org/apache/log4j/package-use.html... Generating /builddir/build/BUILD/apache-log4j-1.2.17/target/apidocs/org/apache/log4j/chainsaw/package-use.html... Generating /builddir/build/BUILD/apache-log4j-1.2.17/target/apidocs/org/apache/log4j/config/package-use.html... Generating /builddir/build/BUILD/apache-log4j-1.2.17/target/apidocs/org/apache/log4j/helpers/package-use.html... Generating /builddir/build/BUILD/apache-log4j-1.2.17/target/apidocs/org/apache/log4j/jdbc/package-use.html... Generating /builddir/build/BUILD/apache-log4j-1.2.17/target/apidocs/org/apache/log4j/jmx/package-use.html... Generating /builddir/build/BUILD/apache-log4j-1.2.17/target/apidocs/org/apache/log4j/lf5/package-use.html... Generating /builddir/build/BUILD/apache-log4j-1.2.17/target/apidocs/org/apache/log4j/lf5/util/package-use.html... Generating /builddir/build/BUILD/apache-log4j-1.2.17/target/apidocs/org/apache/log4j/lf5/viewer/package-use.html... Generating /builddir/build/BUILD/apache-log4j-1.2.17/target/apidocs/org/apache/log4j/lf5/viewer/categoryexplorer/package-use.html... Generating /builddir/build/BUILD/apache-log4j-1.2.17/target/apidocs/org/apache/log4j/lf5/viewer/configure/package-use.html... Generating /builddir/build/BUILD/apache-log4j-1.2.17/target/apidocs/org/apache/log4j/net/package-use.html... Generating /builddir/build/BUILD/apache-log4j-1.2.17/target/apidocs/org/apache/log4j/nt/package-use.html... Generating /builddir/build/BUILD/apache-log4j-1.2.17/target/apidocs/org/apache/log4j/or/package-use.html... Generating /builddir/build/BUILD/apache-log4j-1.2.17/target/apidocs/org/apache/log4j/or/jms/package-use.html... Generating /builddir/build/BUILD/apache-log4j-1.2.17/target/apidocs/org/apache/log4j/or/sax/package-use.html... Generating /builddir/build/BUILD/apache-log4j-1.2.17/target/apidocs/org/apache/log4j/pattern/package-use.html... Generating /builddir/build/BUILD/apache-log4j-1.2.17/target/apidocs/org/apache/log4j/rewrite/package-use.html... Generating /builddir/build/BUILD/apache-log4j-1.2.17/target/apidocs/org/apache/log4j/spi/package-use.html... Generating /builddir/build/BUILD/apache-log4j-1.2.17/target/apidocs/org/apache/log4j/varia/package-use.html... Generating /builddir/build/BUILD/apache-log4j-1.2.17/target/apidocs/org/apache/log4j/xml/package-use.html... Generating /builddir/build/BUILD/apache-log4j-1.2.17/target/apidocs/org/apache/log4j/xml/examples/package-use.html... Building index for all the packages and classes... Generating /builddir/build/BUILD/apache-log4j-1.2.17/target/apidocs/overview-tree.html... Generating /builddir/build/BUILD/apache-log4j-1.2.17/target/apidocs/index-all.html... Generating /builddir/build/BUILD/apache-log4j-1.2.17/target/apidocs/deprecated-list.html... Building index for all classes... Generating /builddir/build/BUILD/apache-log4j-1.2.17/target/apidocs/allclasses-frame.html... Generating /builddir/build/BUILD/apache-log4j-1.2.17/target/apidocs/allclasses-noframe.html... Generating /builddir/build/BUILD/apache-log4j-1.2.17/target/apidocs/index.html... Generating /builddir/build/BUILD/apache-log4j-1.2.17/target/apidocs/overview-summary.html... Generating /builddir/build/BUILD/apache-log4j-1.2.17/target/apidocs/help-doc.html... 76 errors 100 warnings [INFO] [INFO] ------------------------------------------------------------------------ [INFO] Skipping Apache Log4j [INFO] This project has been banned from the build due to previous failures. [INFO] ------------------------------------------------------------------------ [INFO] ------------------------------------------------------------------------ [INFO] BUILD FAILURE [INFO] ------------------------------------------------------------------------ [INFO] Total time: 1:14.202s [INFO] Finished at: Thu Aug 26 18:41:19 CST 2021 [INFO] Final Memory: 37M/2301M [INFO] ------------------------------------------------------------------------ [ERROR] Failed to execute goal org.apache.maven.plugins:maven-javadoc-plugin:2.9:jar (default) on project log4j: MavenReportException: Error while creating archive: [ERROR] Exit code: 1 - /builddir/build/BUILD/apache-log4j-1.2.17/src/main/java/org/apache/log4j/helpers/PatternConverter.java:58: warning: no @param for event [ERROR] String convert(LoggingEvent event); [ERROR] ^ [ERROR] /builddir/build/BUILD/apache-log4j-1.2.17/src/main/java/org/apache/log4j/helpers/PatternConverter.java:58: warning: no @return [ERROR] String convert(LoggingEvent event); [ERROR] ^ [ERROR] /builddir/build/BUILD/apache-log4j-1.2.17/src/main/java/org/apache/log4j/helpers/PatternConverter.java:64: warning: no @param for sbuf [ERROR] void format(StringBuffer sbuf, LoggingEvent e) { [ERROR] ^ [ERROR] /builddir/build/BUILD/apache-log4j-1.2.17/src/main/java/org/apache/log4j/helpers/PatternConverter.java:64: warning: no @param for e [ERROR] void format(StringBuffer sbuf, LoggingEvent e) { [ERROR] ^ [ERROR] /builddir/build/BUILD/apache-log4j-1.2.17/src/main/java/org/apache/log4j/helpers/PatternConverter.java:99: warning: no @param for sbuf [ERROR] void spacePad(StringBuffer sbuf, int length) { [ERROR] ^ [ERROR] /builddir/build/BUILD/apache-log4j-1.2.17/src/main/java/org/apache/log4j/helpers/PatternConverter.java:99: warning: no @param for length [ERROR] void spacePad(StringBuffer sbuf, int length) { [ERROR] ^ [ERROR] /builddir/build/BUILD/apache-log4j-1.2.17/src/main/java/org/apache/log4j/helpers/PatternParser.java:111: warning: no @return [ERROR] int extractPrecisionOption() { [ERROR] ^ [ERROR] /builddir/build/BUILD/apache-log4j-1.2.17/src/main/java/org/apache/log4j/pattern/LogEvent.java:250: warning: no @return [ERROR] public LocationInfo getLocationInformation() { [ERROR] ^ [ERROR] /builddir/build/BUILD/apache-log4j-1.2.17/src/main/java/org/apache/log4j/pattern/LogEvent.java:260: warning: no @return [ERROR] public Level getLevel() { [ERROR] ^ [ERROR] /builddir/build/BUILD/apache-log4j-1.2.17/src/main/java/org/apache/log4j/pattern/LogEvent.java:268: warning: no @return [ERROR] public String getLoggerName() { [ERROR] ^ [ERROR] /builddir/build/BUILD/apache-log4j-1.2.17/src/main/java/org/apache/log4j/pattern/LogEvent.java:282: warning: no @return [ERROR] Object getMessage() { [ERROR] ^ [ERROR] /builddir/build/BUILD/apache-log4j-1.2.17/src/main/java/org/apache/log4j/pattern/LogEvent.java:296: warning: no @return [ERROR] String getNDC() { [ERROR] ^ [ERROR] /builddir/build/BUILD/apache-log4j-1.2.17/src/main/java/org/apache/log4j/pattern/LogEvent.java:318: warning: no @param for key [ERROR] Object getMDC(String key) { [ERROR] ^ [ERROR] /builddir/build/BUILD/apache-log4j-1.2.17/src/main/java/org/apache/log4j/pattern/LogEvent.java:318: warning: no @return [ERROR] Object getMDC(String key) { [ERROR] ^ [ERROR] /builddir/build/BUILD/apache-log4j-1.2.17/src/main/java/org/apache/log4j/pattern/LogEvent.java:370: warning: no @return [ERROR] public static long getStartTime() { [ERROR] ^ [ERROR] /builddir/build/BUILD/apache-log4j-1.2.17/src/main/java/org/apache/log4j/pattern/LogEvent.java:390: warning: no @return [ERROR] ThrowableInformation getThrowableInformation() { [ERROR] ^ [ERROR] /builddir/build/BUILD/apache-log4j-1.2.17/src/main/java/org/apache/log4j/pattern/LogEvent.java:398: warning: no @return [ERROR] String[] getThrowableStrRep() { [ERROR] ^ [ERROR] /builddir/build/BUILD/apache-log4j-1.2.17/src/main/java/org/apache/log4j/pattern/LogEvent.java:497: warning: no description for @param [ERROR] * @param propName [ERROR] ^ [ERROR] /builddir/build/BUILD/apache-log4j-1.2.17/src/main/java/org/apache/log4j/pattern/LogEvent.java:498: warning: no description for @param [ERROR] * @param propValue [ERROR] ^ [ERROR] /builddir/build/BUILD/apache-log4j-1.2.17/src/main/java/org/apache/log4j/pattern/LogEvent.java:181: warning: no @param for fqnOfCategoryClass [ERROR] public LogEvent(String fqnOfCategoryClass, Category logger, [ERROR] ^ [ERROR] /builddir/build/BUILD/apache-log4j-1.2.17/src/main/java/org/apache/log4j/pattern/LogEvent.java:157: warning: no @param for fqnOfCategoryClass [ERROR] public LogEvent(String fqnOfCategoryClass, Category logger, [ERROR] ^ [ERROR] /builddir/build/BUILD/apache-log4j-1.2.17/src/main/java/org/apache/log4j/helpers/AppenderAttachableImpl.java:58: warning: no @param for event [ERROR] int appendLoopOnAppenders(LoggingEvent event) { [ERROR] ^ [ERROR] /builddir/build/BUILD/apache-log4j-1.2.17/src/main/java/org/apache/log4j/helpers/AppenderAttachableImpl.java:58: warning: no @return [ERROR] int appendLoopOnAppenders(LoggingEvent event) { [ERROR] ^ [ERROR] /builddir/build/BUILD/apache-log4j-1.2.17/src/main/java/org/apache/log4j/spi/AppenderAttachable.java:34: warning: no @param for newAppender [ERROR] void addAppender(Appender newAppender); [ERROR] ^ [ERROR] /builddir/build/BUILD/apache-log4j-1.2.17/src/main/java/org/apache/log4j/spi/AppenderAttachable.java:39: warning: no @return [ERROR] Enumeration getAllAppenders(); [ERROR] ^ [ERROR] /builddir/build/BUILD/apache-log4j-1.2.17/src/main/java/org/apache/log4j/spi/AppenderAttachable.java:45: warning: no @param for name [ERROR] Appender getAppender(String name); [ERROR] ^ [ERROR] /builddir/build/BUILD/apache-log4j-1.2.17/src/main/java/org/apache/log4j/spi/AppenderAttachable.java:45: warning: no @return [ERROR] Appender getAppender(String name); [ERROR] ^ [ERROR] /builddir/build/BUILD/apache-log4j-1.2.17/src/main/java/org/apache/log4j/spi/AppenderAttachable.java:54: warning: no @param for appender [ERROR] boolean isAttached(Appender appender); [ERROR] ^ [ERROR] /builddir/build/BUILD/apache-log4j-1.2.17/src/main/java/org/apache/log4j/spi/AppenderAttachable.java:54: warning: no @return [ERROR] boolean isAttached(Appender appender); [ERROR] ^ [ERROR] /builddir/build/BUILD/apache-log4j-1.2.17/src/main/java/org/apache/log4j/spi/AppenderAttachable.java:65: warning: no @param for appender [ERROR] void removeAppender(Appender appender); [ERROR] ^ [ERROR] /builddir/build/BUILD/apache-log4j-1.2.17/src/main/java/org/apache/log4j/spi/AppenderAttachable.java:73: warning: no @param for name [ERROR] removeAppender(String name); [ERROR] ^ [ERROR] /builddir/build/BUILD/apache-log4j-1.2.17/src/main/java/org/apache/log4j/helpers/BoundedFIFO.java:56: warning: no @return [ERROR] LoggingEvent get() { [ERROR] ^ [ERROR] /builddir/build/BUILD/apache-log4j-1.2.17/src/main/java/org/apache/log4j/helpers/BoundedFIFO.java:75: warning: no @param for o [ERROR] void put(LoggingEvent o) { [ERROR] ^ [ERROR] /builddir/build/BUILD/apache-log4j-1.2.17/src/main/java/org/apache/log4j/helpers/BoundedFIFO.java:89: warning: no @return [ERROR] int getMaxSize() { [ERROR] ^ [ERROR] /builddir/build/BUILD/apache-log4j-1.2.17/src/main/java/org/apache/log4j/helpers/BoundedFIFO.java:97: warning: no @return [ERROR] boolean isFull() { [ERROR] ^ [ERROR] /builddir/build/BUILD/apache-log4j-1.2.17/src/main/java/org/apache/log4j/helpers/BoundedFIFO.java:107: warning: no @return [ERROR] int length() { [ERROR] ^ [ERROR] /builddir/build/BUILD/apache-log4j-1.2.17/src/main/java/org/apache/log4j/helpers/BoundedFIFO.java:125: warning: no @param for newSize [ERROR] void resize(int newSize) { [ERROR] ^ [ERROR] /builddir/build/BUILD/apache-log4j-1.2.17/src/main/java/org/apache/log4j/helpers/BoundedFIFO.java:168: warning: no @return [ERROR] boolean wasEmpty() { [ERROR] ^ [ERROR] /builddir/build/BUILD/apache-log4j-1.2.17/src/main/java/org/apache/log4j/helpers/BoundedFIFO.java:177: warning: no @return [ERROR] boolean wasFull() { [ERROR] ^ [ERROR] /builddir/build/BUILD/apache-log4j-1.2.17/src/main/java/org/apache/log4j/helpers/BoundedFIFO.java:43: warning: no @param for maxSize [ERROR] BoundedFIFO(int maxSize) { [ERROR] ^ [ERROR] /builddir/build/BUILD/apache-log4j-1.2.17/src/main/java/org/apache/log4j/helpers/CyclicBuffer.java:66: warning: no @param for event [ERROR] void add(LoggingEvent event) { [ERROR] ^ [ERROR] /builddir/build/BUILD/apache-log4j-1.2.17/src/main/java/org/apache/log4j/helpers/CyclicBuffer.java:86: warning: no @param for i [ERROR] LoggingEvent get(int i) { [ERROR] ^ [ERROR] /builddir/build/BUILD/apache-log4j-1.2.17/src/main/java/org/apache/log4j/helpers/CyclicBuffer.java:86: warning: no @return [ERROR] LoggingEvent get(int i) { [ERROR] ^ [ERROR] /builddir/build/BUILD/apache-log4j-1.2.17/src/main/java/org/apache/log4j/helpers/CyclicBuffer.java:103: warning: no @return [ERROR] LoggingEvent get() { [ERROR] ^ [ERROR] /builddir/build/BUILD/apache-log4j-1.2.17/src/main/java/org/apache/log4j/helpers/CyclicBuffer.java:121: warning: no @return [ERROR] int length() { [ERROR] ^ [ERROR] /builddir/build/BUILD/apache-log4j-1.2.17/src/main/java/org/apache/log4j/helpers/CyclicBuffer.java:131: warning: no @param for newSize [ERROR] void resize(int newSize) { [ERROR] ^ [ERROR] /builddir/build/BUILD/apache-log4j-1.2.17/src/main/java/org/apache/log4j/helpers/DateLayout.java:78: warning: no @return [ERROR] String[] getOptionStrings() { [ERROR] ^ [ERROR] /builddir/build/BUILD/apache-log4j-1.2.17/src/main/java/org/apache/log4j/helpers/DateLayout.java:87: warning: no @param for option [ERROR] void setOption(String option, String value) { [ERROR] ^ [ERROR] /builddir/build/BUILD/apache-log4j-1.2.17/src/main/java/org/apache/log4j/helpers/DateLayout.java:87: warning: no @param for value [ERROR] void setOption(String option, String value) { [ERROR] ^ [ERROR] /builddir/build/BUILD/apache-log4j-1.2.17/src/main/java/org/apache/log4j/helpers/DateLayout.java:102: warning: no @param for dateFormat [ERROR] void setDateFormat(String dateFormat) { [ERROR] ^ [ERROR] /builddir/build/BUILD/apache-log4j-1.2.17/src/main/java/org/apache/log4j/helpers/DateLayout.java:113: warning: no @return [ERROR] String getDateFormat() { [ERROR] ^ [ERROR] /builddir/build/BUILD/apache-log4j-1.2.17/src/main/java/org/apache/log4j/helpers/DateLayout.java:122: warning: no @param for timeZone [ERROR] void setTimeZone(String timeZone) { [ERROR] ^ [ERROR] /builddir/build/BUILD/apache-log4j-1.2.17/src/main/java/org/apache/log4j/helpers/DateLayout.java:130: warning: no @return [ERROR] String getTimeZone() { [ERROR] ^ [ERROR] /builddir/build/BUILD/apache-log4j-1.2.17/src/main/java/org/apache/log4j/helpers/DateLayout.java:156: warning: no @param for dateFormat [ERROR] void setDateFormat(DateFormat dateFormat, TimeZone timeZone) { [ERROR] ^ [ERROR] /builddir/build/BUILD/apache-log4j-1.2.17/src/main/java/org/apache/log4j/helpers/DateLayout.java:156: warning: no @param for timeZone [ERROR] void setDateFormat(DateFormat dateFormat, TimeZone timeZone) { [ERROR] ^ [ERROR] /builddir/build/BUILD/apache-log4j-1.2.17/src/main/java/org/apache/log4j/helpers/DateLayout.java:176: warning: no @param for dateFormatType [ERROR] void setDateFormat(String dateFormatType, TimeZone timeZone) { [ERROR] ^ [ERROR] /builddir/build/BUILD/apache-log4j-1.2.17/src/main/java/org/apache/log4j/helpers/DateLayout.java:176: warning: no @param for timeZone [ERROR] void setDateFormat(String dateFormatType, TimeZone timeZone) { [ERROR] ^ [ERROR] /builddir/build/BUILD/apache-log4j-1.2.17/src/main/java/org/apache/log4j/Layout.java:43: warning: no @param for event [ERROR] String format(LoggingEvent event); [ERROR] ^ [ERROR] /builddir/build/BUILD/apache-log4j-1.2.17/src/main/java/org/apache/log4j/Layout.java:43: warning: no @return [ERROR] String format(LoggingEvent event); [ERROR] ^ [ERROR] /builddir/build/BUILD/apache-log4j-1.2.17/src/main/java/org/apache/log4j/Layout.java:50: warning: no @return [ERROR] String getContentType() { [ERROR] ^ [ERROR] /builddir/build/BUILD/apache-log4j-1.2.17/src/main/java/org/apache/log4j/Layout.java:58: warning: no @return [ERROR] String getHeader() { [ERROR] ^ [ERROR] /builddir/build/BUILD/apache-log4j-1.2.17/src/main/java/org/apache/log4j/Layout.java:66: warning: no @return [ERROR] String getFooter() { [ERROR] ^ [ERROR] /builddir/build/BUILD/apache-log4j-1.2.17/src/main/java/org/apache/log4j/Layout.java:87: warning: no @return [ERROR] boolean ignoresThrowable(); [ERROR] ^ [ERROR] /builddir/build/BUILD/apache-log4j-1.2.17/src/main/java/org/apache/log4j/helpers/FileWatchdog.java:65: warning: no @param for delay [ERROR] void setDelay(long delay) { [ERROR] ^ [ERROR] /builddir/build/BUILD/apache-log4j-1.2.17/src/main/java/org/apache/log4j/helpers/Loader.java:74: error: tag not allowed here:

[ERROR]

  • Search for resource using the thread context [ERROR] ^ [ERROR] /builddir/build/BUILD/apache-log4j-1.2.17/src/main/java/org/apache/log4j/helpers/Loader.java:74: warning: empty

    tag [ERROR]

  • Search for resource using the thread context [ERROR] ^ [ERROR] /builddir/build/BUILD/apache-log4j-1.2.17/src/main/java/org/apache/log4j/helpers/Loader.java:80: warning: empty

    tag [ERROR]

  • Try one last time with [ERROR] ^ [ERROR] /builddir/build/BUILD/apache-log4j-1.2.17/src/main/java/org/apache/log4j/helpers/Loader.java:87: warning: no @param for resource [ERROR] static public URL getResource(String resource) { [ERROR] ^ [ERROR] /builddir/build/BUILD/apache-log4j-1.2.17/src/main/java/org/apache/log4j/helpers/Loader.java:87: warning: no @return [ERROR] static public URL getResource(String resource) { [ERROR] ^ [ERROR] /builddir/build/BUILD/apache-log4j-1.2.17/src/main/java/org/apache/log4j/helpers/Loader.java:144: warning: no @return [ERROR] boolean isJava1() { [ERROR] ^ [ERROR] /builddir/build/BUILD/apache-log4j-1.2.17/src/main/java/org/apache/log4j/helpers/Loader.java:178: warning: no @param for clazz [ERROR] static public Class loadClass (String clazz) throws ClassNotFoundException { [ERROR] ^ [ERROR] /builddir/build/BUILD/apache-log4j-1.2.17/src/main/java/org/apache/log4j/helpers/Loader.java:178: warning: no @return [ERROR] static public Class loadClass (String clazz) throws ClassNotFoundException { [ERROR] ^ [ERROR] /builddir/build/BUILD/apache-log4j-1.2.17/src/main/java/org/apache/log4j/helpers/Loader.java:178: warning: no @throws for java.lang.ClassNotFoundException [ERROR] static public Class loadClass (String clazz) throws ClassNotFoundException { [ERROR] ^ [ERROR] /builddir/build/BUILD/apache-log4j-1.2.17/src/main/java/org/apache/log4j/helpers/LogLog.java:88: warning: no @param for enabled [ERROR] void setInternalDebugging(boolean enabled) { [ERROR] ^ [ERROR] /builddir/build/BUILD/apache-log4j-1.2.17/src/main/java/org/apache/log4j/helpers/LogLog.java:98: warning: no @param for msg [ERROR] void debug(String msg) { [ERROR] ^ [ERROR] /builddir/build/BUILD/apache-log4j-1.2.17/src/main/java/org/apache/log4j/helpers/LogLog.java:110: warning: no @param for msg [ERROR] void debug(String msg, Throwable t) { [ERROR] ^ [ERROR] /builddir/build/BUILD/apache-log4j-1.2.17/src/main/java/org/apache/log4j/helpers/LogLog.java:110: warning: no @param for t [ERROR] void debug(String msg, Throwable t) { [ERROR] ^ [ERROR] /builddir/build/BUILD/apache-log4j-1.2.17/src/main/java/org/apache/log4j/helpers/LogLog.java:126: warning: no @param for msg [ERROR] void error(String msg) { [ERROR] ^ [ERROR] /builddir/build/BUILD/apache-log4j-1.2.17/src/main/java/org/apache/log4j/helpers/LogLog.java:139: warning: no @param for msg [ERROR] void error(String msg, Throwable t) { [ERROR] ^ [ERROR] /builddir/build/BUILD/apache-log4j-1.2.17/src/main/java/org/apache/log4j/helpers/LogLog.java:139: warning: no @param for t [ERROR] void error(String msg, Throwable t) { [ERROR] ^ [ERROR] /builddir/build/BUILD/apache-log4j-1.2.17/src/main/java/org/apache/log4j/helpers/LogLog.java:167: warning: no @param for msg [ERROR] void warn(String msg) { [ERROR] ^ [ERROR] /builddir/build/BUILD/apache-log4j-1.2.17/src/main/java/org/apache/log4j/helpers/LogLog.java:180: warning: no @param for msg [ERROR] void warn(String msg, Throwable t) { [ERROR] ^ [ERROR] /builddir/build/BUILD/apache-log4j-1.2.17/src/main/java/org/apache/log4j/helpers/LogLog.java:180: warning: no @param for t [ERROR] void warn(String msg, Throwable t) { [ERROR] ^ [ERROR] /builddir/build/BUILD/apache-log4j-1.2.17/src/main/java/org/apache/log4j/spi/ErrorHandler.java:60: warning: no @param for message [ERROR] void error(String message, Exception e, int errorCode); [ERROR] ^ [ERROR] /builddir/build/BUILD/apache-log4j-1.2.17/src/main/java/org/apache/log4j/spi/ErrorHandler.java:60: warning: no @param for e [ERROR] void error(String message, Exception e, int errorCode); [ERROR] ^ [ERROR] /builddir/build/BUILD/apache-log4j-1.2.17/src/main/java/org/apache/log4j/spi/ErrorHandler.java:60: warning: no @param for errorCode [ERROR] void error(String message, Exception e, int errorCode); [ERROR] ^ [ERROR] /builddir/build/BUILD/apache-log4j-1.2.17/src/main/java/org/apache/log4j/spi/ErrorHandler.java:66: warning: no @param for message [ERROR] void error(String message); [ERROR] ^ [ERROR] /builddir/build/BUILD/apache-log4j-1.2.17/src/main/java/org/apache/log4j/spi/ErrorHandler.java:85: warning: no @param for appender [ERROR] void setAppender(Appender appender); [ERROR] ^ [ERROR] /builddir/build/BUILD/apache-log4j-1.2.17/src/main/java/org/apache/log4j/spi/ErrorHandler.java:91: warning: no @param for appender [ERROR] void setBackupAppender(Appender appender); [ERROR] ^ [ERROR] /builddir/build/BUILD/apache-log4j-1.2.17/src/main/java/org/apache/log4j/helpers/OptionConverter.java:137: warning: no @param for value [ERROR] boolean toBoolean(String value, boolean dEfault) { [ERROR] ^ [ERROR] /builddir/build/BUILD/apache-log4j-1.2.17/src/main/java/org/apache/log4j/helpers/OptionConverter.java:137: warning: no @param for dEfault [ERROR] boolean toBoolean(String value, boolean dEfault) { [ERROR] ^ [ERROR] /builddir/build/BUILD/apache-log4j-1.2.17/src/main/java/org/apache/log4j/helpers/OptionConverter.java:137: warning: no @return [ERROR] boolean toBoolean(String value, boolean dEfault) { [ERROR] ^ [ERROR] /builddir/build/BUILD/apache-log4j-1.2.17/src/main/java/org/apache/log4j/helpers/OptionConverter.java:186: warning: no @param for value [ERROR] Level toLevel(String value, Level defaultValue) { [ERROR] ^ [ERROR] /builddir/build/BUILD/apache-log4j-1.2.17/src/main/java/org/apache/log4j/helpers/OptionConverter.java:186: warning: no @param for defaultValue [ERROR] Level toLevel(String value, Level defaultValue) { [ERROR] ^ [ERROR] /builddir/build/BUILD/apache-log4j-1.2.17/src/main/java/org/apache/log4j/helpers/OptionConverter.java:186: warning: no @return [ERROR] Level toLevel(String value, Level defaultValue) { [ERROR] ^ [ERROR] /builddir/build/BUILD/apache-log4j-1.2.17/src/main/java/org/apache/log4j/helpers/OptionConverter.java:298: warning: no @param for key [ERROR] String findAndSubst(String key, Properties props) { [ERROR] ^ [ERROR] /builddir/build/BUILD/apache-log4j-1.2.17/src/main/java/org/apache/log4j/helpers/OptionConverter.java:298: warning: no @param for props [ERROR] String findAndSubst(String key, Properties props) { [ERROR] ^ [ERROR] /builddir/build/BUILD/apache-log4j-1.2.17/src/main/java/org/apache/log4j/helpers/OptionConverter.java:298: warning: no @return [ERROR] String findAndSubst(String key, Properties props) { [ERROR] ^ [ERROR] /builddir/build/BUILD/apache-log4j-1.2.17/src/main/java/org/apache/log4j/helpers/OptionConverter.java:323: warning: no @return [ERROR] Object instantiateByClassName(String className, Class superClass, [ERROR] ^ [ERROR] /builddir/build/BUILD/apache-log4j-1.2.17/src/main/java/org/apache/log4j/helpers/OptionConverter.java:382: error: unexpected end tag: [ERROR]

    Author Avy Sharell

    [ERROR] ^ [ERROR] /builddir/build/BUILD/apache-log4j-1.2.17/src/main/java/org/apache/log4j/helpers/OptionConverter.java:382: error: unexpected end tag:

    [ERROR]

    Author Avy Sharell

    [ERROR] ^ [ERROR] /builddir/build/BUILD/apache-log4j-1.2.17/src/main/java/org/apache/log4j/helpers/OptionConverter.java:389: warning: no @param for props [ERROR] String substVars(String val, Properties props) throws [ERROR] ^ [ERROR] /builddir/build/BUILD/apache-log4j-1.2.17/src/main/java/org/apache/log4j/helpers/OptionConverter.java:389: warning: no @return [ERROR] String substVars(String val, Properties props) throws [ERROR] ^ [ERROR] /builddir/build/BUILD/apache-log4j-1.2.17/src/main/java/org/apache/log4j/helpers/PatternParser.java:39: error: malformed HTML [ERROR] @author James P. Cakalic [ERROR] ^ [ERROR] /builddir/build/BUILD/apache-log4j-1.2.17/src/main/java/org/apache/log4j/helpers/PatternParser.java:39: error: bad use of '>' [ERROR] @author James P. Cakalic [ERROR] ^ [ERROR] /builddir/build/BUILD/apache-log4j-1.2.17/src/main/java/org/apache/log4j/helpers/PatternParser.java:39: error: unexpected end tag: [ERROR] @author James P. Cakalic [ERROR] ^ [ERROR] /builddir/build/BUILD/apache-log4j-1.2.17/src/main/java/org/apache/log4j/helpers/Transform.java:37: error: malformed HTML [ERROR] * '<', '>' , '&' or '"' [ERROR] ^ [ERROR] /builddir/build/BUILD/apache-log4j-1.2.17/src/main/java/org/apache/log4j/helpers/Transform.java:37: error: bad use of '>' [ERROR] * '<', '>' , '&' or '"' [ERROR] ^ [ERROR] /builddir/build/BUILD/apache-log4j-1.2.17/src/main/java/org/apache/log4j/helpers/Transform.java:37: error: bad HTML entity [ERROR] * '<', '>' , '&' or '"' [ERROR] ^ [ERROR] /builddir/build/BUILD/apache-log4j-1.2.17/src/main/java/org/apache/log4j/helpers/Transform.java:83: error: bad use of '>' [ERROR] * Ensures that embeded CDEnd strings (]]>) are handled properly [ERROR] ^ [ERROR] /builddir/build/BUILD/apache-log4j-1.2.17/src/main/java/org/apache/log4j/helpers/Transform.java:87: error: malformed HTML [ERROR] * initial CDStart () of the CDATA [ERROR] ^ [ERROR] /builddir/build/BUILD/apache-log4j-1.2.17/src/main/java/org/apache/log4j/helpers/Transform.java:87: error: bad use of '>' [ERROR] * initial CDStart () of the CDATA [ERROR] ^ [ERROR] /builddir/build/BUILD/apache-log4j-1.2.17/src/main/java/org/apache/log4j/or/RendererMap.java:136: error: no summary or caption for table [ERROR] [ERROR] ^ [ERROR] /builddir/build/BUILD/apache-log4j-1.2.17/src/main/java/org/apache/log4j/jdbc/JDBCAppender.java:157: error: self-closing element not allowed [ERROR] *

    [ERROR] ^ [ERROR] /builddir/build/BUILD/apache-log4j-1.2.17/src/main/java/org/apache/log4j/jdbc/JDBCAppender.java:158: error: self-closing element not allowed [ERROR] *

    [ERROR] ^ [ERROR] /builddir/build/BUILD/apache-log4j-1.2.17/src/main/java/org/apache/log4j/jdbc/JDBCAppender.java:42: error: bad HTML entity [ERROR] BufferSize, db URL, User, & Password are [ERROR] ^ [ERROR] /builddir/build/BUILD/apache-log4j-1.2.17/src/main/java/org/apache/log4j/lf5/viewer/LF5SwingUtils.java:136: error: incorrect use of inline tag [ERROR] * @link http://developer.java.sun.com/developer/bugParade/bugs/4205145.html [ERROR] ^ [ERROR] /builddir/build/BUILD/apache-log4j-1.2.17/src/main/java/org/apache/log4j/lf5/viewer/LogTableColumn.java:137: error: bad use of '>' [ERROR] * @return A List of LogTableColumn/code> objects that map [ERROR] ^ [ERROR] /builddir/build/BUILD/apache-log4j-1.2.17/src/main/java/org/apache/log4j/lf5/viewer/LogTableColumn.java:137: error: element not closed: code [ERROR] * @return A List of LogTableColumn/code> objects that map [ERROR] ^ [ERROR] /builddir/build/BUILD/apache-log4j-1.2.17/src/main/java/org/apache/log4j/lf5/DefaultLF5Configurator.java:75: error: unknown tag: bold [ERROR] * defaultconfig.properties. [ERROR] ^ [ERROR] /builddir/build/BUILD/apache-log4j-1.2.17/src/main/java/org/apache/log4j/lf5/DefaultLF5Configurator.java:75: error: unknown tag: bold [ERROR] * defaultconfig.properties. [ERROR] ^ [ERROR] /builddir/build/BUILD/apache-log4j-1.2.17/src/main/java/org/apache/log4j/lf5/LF5Appender.java:61: error: unknown tag: bold [ERROR] * the LogBrokerMonitor. This constructor should always [ERROR] ^ [ERROR] /builddir/build/BUILD/apache-log4j-1.2.17/src/main/java/org/apache/log4j/lf5/LF5Appender.java:62: error: unknown tag: bold [ERROR] * be preferred over the [ERROR] ^ [ERROR] /builddir/build/BUILD/apache-log4j-1.2.17/src/main/java/org/apache/log4j/lf5/LF5Appender.java:77: error: element not closed: code [ERROR] * @param monitor An instance of a LogBrokerMonitor [ERROR] ^ [ERROR] /builddir/build/BUILD/apache-log4j-1.2.17/src/main/java/org/apache/log4j/lf5/LF5Appender.java:77: error: element not closed: code [ERROR] * @param monitor An instance of a LogBrokerMonitor [ERROR] ^ [ERROR] /builddir/build/BUILD/apache-log4j-1.2.17/src/main/java/org/apache/log4j/lf5/LF5Appender.java:73: error: element not closed: code [ERROR] * a LogBrokerMonitor supplied by the user. This [ERROR] ^ [ERROR] /builddir/build/BUILD/apache-log4j-1.2.17/src/main/java/org/apache/log4j/lf5/LF5Appender.java:73: error: element not closed: code [ERROR] * a LogBrokerMonitor supplied by the user. This [ERROR] ^ [ERROR] /builddir/build/BUILD/apache-log4j-1.2.17/src/main/java/org/apache/log4j/lf5/LF5Appender.java:72: error: element not closed: code [ERROR] * Constructs a LF5Appender using an instance of [ERROR] ^ [ERROR] /builddir/build/BUILD/apache-log4j-1.2.17/src/main/java/org/apache/log4j/lf5/LF5Appender.java:72: error: element not closed: code [ERROR] * Constructs a LF5Appender using an instance of [ERROR] ^ [ERROR] /builddir/build/BUILD/apache-log4j-1.2.17/src/main/java/org/apache/log4j/lf5/LogLevelFormatException.java:24: error: malformed HTML [ERROR] * @author Michael J. Sikorsky< [ERROR] ^ [ERROR] /builddir/build/BUILD/apache-log4j-1.2.17/src/main/java/org/apache/log4j/net/SocketAppender.java:41: error: tag not allowed here:

    [ERROR]

  • If sent to a {@link SocketNode}, remote logging is [ERROR] ^ [ERROR] /builddir/build/BUILD/apache-log4j-1.2.17/src/main/java/org/apache/log4j/net/SocketHubAppender.java:60: error: tag not allowed here:

    [ERROR]

  • If sent to a {@link SocketNode}, logging is non-intrusive as [ERROR] ^ [ERROR] /builddir/build/BUILD/apache-log4j-1.2.17/src/main/java/org/apache/log4j/net/TelnetAppender.java:56: error: no summary or caption for table [ERROR] [ERROR] ^ [ERROR] /builddir/build/BUILD/apache-log4j-1.2.17/src/main/java/org/apache/log4j/xml/DOMConfigurator.java:78: error: bad use of '>' [ERROR] <log4j:configuration debug="true" xmlns:log4j="http://jakarta.apache.org/log4j/"> [ERROR] ^ [ERROR] /builddir/build/BUILD/apache-log4j-1.2.17/src/main/java/org/apache/log4j/xml/DOMConfigurator.java:80: error: bad use of '>' [ERROR] </log4j:configuration> [ERROR] ^ [ERROR] /builddir/build/BUILD/apache-log4j-1.2.17/src/main/java/org/apache/log4j/xml/XMLLayout.java:47: error: invalid entity &data; [ERROR]   &data; [ERROR] ^ [ERROR] /builddir/build/BUILD/apache-log4j-1.2.17/src/main/java/org/apache/log4j/AsyncAppender.java:353: error: self-closing element not allowed [ERROR] *

    [ERROR] ^ [ERROR] /builddir/build/BUILD/apache-log4j-1.2.17/src/main/java/org/apache/log4j/AsyncAppender.java:354: error: self-closing element not allowed [ERROR] *

    [ERROR] ^ [ERROR] /builddir/build/BUILD/apache-log4j-1.2.17/src/main/java/org/apache/log4j/AsyncAppender.java:37: error: self-closing element not allowed [ERROR] *

    [ERROR] ^ [ERROR] /builddir/build/BUILD/apache-log4j-1.2.17/src/main/java/org/apache/log4j/AsyncAppender.java:38: error: self-closing element not allowed [ERROR] *

    [ERROR] ^ [ERROR] /builddir/build/BUILD/apache-log4j-1.2.17/src/main/java/org/apache/log4j/AsyncAppender.java:43: error: self-closing element not allowed [ERROR] *

    [ERROR] ^ [ERROR] /builddir/build/BUILD/apache-log4j-1.2.17/src/main/java/org/apache/log4j/AsyncAppender.java:44: error: self-closing element not allowed [ERROR] *

    [ERROR] ^ [ERROR] /builddir/build/BUILD/apache-log4j-1.2.17/src/main/java/org/apache/log4j/AsyncAppender.java:47: error: self-closing element not allowed [ERROR] *

    [ERROR] ^ [ERROR] /builddir/build/BUILD/apache-log4j-1.2.17/src/main/java/org/apache/log4j/DailyRollingFileAppender.java:132: error: no summary or caption for table [ERROR] [ERROR] ^ [ERROR] /builddir/build/BUILD/apache-log4j-1.2.17/src/main/java/org/apache/log4j/EnhancedPatternLayout.java:86: error: tag not allowed here: [ERROR] Conversion Character [ERROR] ^ [ERROR] /builddir/build/BUILD/apache-log4j-1.2.17/src/main/java/org/apache/log4j/EnhancedPatternLayout.java:87: error: tag not allowed here: [ERROR] Effect [ERROR] ^ [ERROR] /builddir/build/BUILD/apache-log4j-1.2.17/src/main/java/org/apache/log4j/EnhancedPatternLayout.java:308: error: no summary or caption for table [ERROR] [ERROR] ^ [ERROR] /builddir/build/BUILD/apache-log4j-1.2.17/src/main/java/org/apache/log4j/EnhancedPatternLayout.java:344: error: tag not allowed here: [ERROR] Format modifier [ERROR] ^ [ERROR] /builddir/build/BUILD/apache-log4j-1.2.17/src/main/java/org/apache/log4j/EnhancedPatternLayout.java:345: error: tag not allowed here: [ERROR] left justify [ERROR] ^ [ERROR] /builddir/build/BUILD/apache-log4j-1.2.17/src/main/java/org/apache/log4j/EnhancedPatternLayout.java:346: error: tag not allowed here: [ERROR] minimum width [ERROR] ^ [ERROR] /builddir/build/BUILD/apache-log4j-1.2.17/src/main/java/org/apache/log4j/EnhancedPatternLayout.java:347: error: tag not allowed here: [ERROR] maximum width [ERROR] ^ [ERROR] /builddir/build/BUILD/apache-log4j-1.2.17/src/main/java/org/apache/log4j/EnhancedPatternLayout.java:348: error: tag not allowed here: [ERROR] comment [ERROR] ^ [ERROR] /builddir/build/BUILD/apache-log4j-1.2.17/src/main/java/org/apache/log4j/EnhancedPatternLayout.java:392: error: no summary or caption for table [ERROR] [ERROR] ^ [ERROR] /builddir/build/BUILD/apache-log4j-1.2.17/src/main/java/org/apache/log4j/EnhancedPatternLayout.java:398: error: tag not allowed here:

    [ERROR]

    %r [%t] %-5p %c %x - %m%n [ERROR] ^ [ERROR] /builddir/build/BUILD/apache-log4j-1.2.17/src/main/java/org/apache/log4j/EnhancedPatternLayout.java:399: error: tag not allowed here:

    [ERROR]

    This is essentially the TTCC layout. [ERROR] ^ [ERROR] /builddir/build/BUILD/apache-log4j-1.2.17/src/main/java/org/apache/log4j/EnhancedPatternLayout.java:403: error: tag not allowed here:

    [ERROR]

    Similar to the TTCC layout except that the relative time is [ERROR] ^ [ERROR] /builddir/build/BUILD/apache-log4j-1.2.17/src/main/java/org/apache/log4j/Level.java:31: error: malformed HTML [ERROR] WARN, INFODEBUG and [ERROR] ^ [ERROR] /builddir/build/BUILD/apache-log4j-1.2.17/src/main/java/org/apache/log4j/Level.java:34: error: block element not allowed within inline element : p [ERROR]

    The Level class may be subclassed to define a larger [ERROR] ^ [ERROR] /builddir/build/BUILD/apache-log4j-1.2.17/src/main/java/org/apache/log4j/Level.java:31: error: element not closed: code [ERROR] WARN, INFODEBUG and [ERROR] ^ [ERROR] /builddir/build/BUILD/apache-log4j-1.2.17/src/main/java/org/apache/log4j/Level.java:83: error: malformed HTML [ERROR] * informational events than the DEBUGDEBUG [ERROR] * default intialization procedure is described in the [ERROR] Conversion Character [ERROR] ^ [ERROR] /builddir/build/BUILD/apache-log4j-1.2.17/src/main/java/org/apache/log4j/PatternLayout.java:82: error: tag not allowed here: [ERROR] Effect [ERROR] ^ [ERROR] /builddir/build/BUILD/apache-log4j-1.2.17/src/main/java/org/apache/log4j/PatternLayout.java:287: error: no summary or caption for table [ERROR] [ERROR] ^ [ERROR] /builddir/build/BUILD/apache-log4j-1.2.17/src/main/java/org/apache/log4j/PatternLayout.java:323: error: tag not allowed here: [ERROR] Format modifier [ERROR] ^ [ERROR] /builddir/build/BUILD/apache-log4j-1.2.17/src/main/java/org/apache/log4j/PatternLayout.java:324: error: tag not allowed here: [ERROR] left justify [ERROR] ^ [ERROR] /builddir/build/BUILD/apache-log4j-1.2.17/src/main/java/org/apache/log4j/PatternLayout.java:325: error: tag not allowed here: [ERROR] minimum width [ERROR] ^ [ERROR] /builddir/build/BUILD/apache-log4j-1.2.17/src/main/java/org/apache/log4j/PatternLayout.java:326: error: tag not allowed here: [ERROR] maximum width [ERROR] ^ [ERROR] /builddir/build/BUILD/apache-log4j-1.2.17/src/main/java/org/apache/log4j/PatternLayout.java:327: error: tag not allowed here: [ERROR] comment [ERROR] ^ [ERROR] /builddir/build/BUILD/apache-log4j-1.2.17/src/main/java/org/apache/log4j/PatternLayout.java:371: error: no summary or caption for table [ERROR] [ERROR] ^ [ERROR] /builddir/build/BUILD/apache-log4j-1.2.17/src/main/java/org/apache/log4j/PatternLayout.java:377: error: tag not allowed here:

    [ERROR]

    %r [%t] %-5p %c %x - %m%n [ERROR] ^ [ERROR] /builddir/build/BUILD/apache-log4j-1.2.17/src/main/java/org/apache/log4j/PatternLayout.java:378: error: tag not allowed here:

    [ERROR]

    This is essentially the TTCC layout. [ERROR] ^ [ERROR] /builddir/build/BUILD/apache-log4j-1.2.17/src/main/java/org/apache/log4j/PatternLayout.java:382: error: tag not allowed here:

    [ERROR]

    Similar to the TTCC layout except that the relative time is [ERROR] ^ [ERROR] /builddir/build/BUILD/apache-log4j-1.2.17/src/main/java/org/apache/log4j/WriterAppender.java:61: error: unknown tag: null [ERROR] encoding variable is set to null by [ERROR] ^ [ERROR] /builddir/build/BUILD/apache-log4j-1.2.17/src/main/java/org/apache/log4j/WriterAppender.java:61: error: element not closed: code [ERROR] encoding variable is set to null by [ERROR] ^ [ERROR] [ERROR] Command line was: /usr/lib/jvm/java-1.8.0-openjdk-1.8.0.242.b08-0.an7.x86_64/jre/../bin/javadoc @options @packages [ERROR] [ERROR] Refer to the generated Javadoc files in '/builddir/build/BUILD/apache-log4j-1.2.17/target/apidocs' dir. [ERROR] -> [Help 1] [ERROR] [ERROR] To see the full stack trace of the errors, re-run Maven with the -e switch. [ERROR] Re-run Maven using the -X switch to enable full debug logging. [ERROR] [ERROR] For more information about the errors and possible solutions, please read the following articles: [ERROR] [Help 1] http://cwiki.apache.org/confluence/display/MAVEN/MojoExecutionException error: Bad exit status from /var/tmp/rpm-tmp.upwIpk (%build) RPM build errors: Bad exit status from /var/tmp/rpm-tmp.upwIpk (%build) Child return code was: 1 EXCEPTION: [Error()] Traceback (most recent call last): File "/usr/lib/python3.6/site-packages/mockbuild/trace_decorator.py", line 93, in trace result = func(*args, **kw) File "/usr/lib/python3.6/site-packages/mockbuild/util.py", line 600, in do_with_status raise exception.Error("Command failed: \n # %s\n%s" % (command, output), child.returncode) mockbuild.exception.Error: Command failed: # /usr/bin/systemd-nspawn -q -M 28b8ce21b1d043b4841c7bf4c2bf6176 -D /var/lib/mock/dist-an7-build-32226-15943/root -a -u mockbuild --capability=cap_ipc_lock --bind=/tmp/mock-resolv.ynqh7ujs:/etc/resolv.conf --bind=/dev/loop-control --bind=/dev/loop0 --bind=/dev/loop1 --bind=/dev/loop2 --bind=/dev/loop3 --bind=/dev/loop4 --bind=/dev/loop5 --bind=/dev/loop6 --bind=/dev/loop7 --bind=/dev/loop8 --bind=/dev/loop9 --bind=/dev/loop10 --bind=/dev/loop11 --setenv=TERM=vt100 --setenv=SHELL=/bin/bash --setenv=HOME=/builddir --setenv=HOSTNAME=mock --setenv=PATH=/usr/bin:/bin:/usr/sbin:/sbin --setenv=PROMPT_COMMAND=printf "\033]0;\007" --setenv=PS1= \s-\v\$ --setenv=LANG=C.UTF-8 --resolv-conf=off bash --login -c /usr/bin/rpmbuild -bb --target noarch --nodeps /builddir/build/SPECS/log4j.spec