Mock Version: 2.12 Mock Version: 2.12 Mock Version: 2.12 ENTER ['do_with_status'](['bash', '--login', '-c', '/usr/bin/rpmbuild -bs --target noarch --nodeps /builddir/build/SPECS/jboss-annotations-1.1-api.spec'], chrootPath='/var/lib/mock/dist-an7-build-31545-15745/root'env={'TERM': 'vt100', 'SHELL': '/bin/bash', 'HOME': '/builddir', 'HOSTNAME': 'mock', 'PATH': '/usr/bin:/bin:/usr/sbin:/sbin', 'PROMPT_COMMAND': 'printf "\\033]0;\\007"', 'PS1': ' \\s-\\v\\$ ', 'LANG': 'C.UTF-8'}shell=Falselogger=timeout=86400uid=989gid=135user='mockbuild'nspawn_args=['--capability=cap_ipc_lock', '--bind=/tmp/mock-resolv.srl5clth:/etc/resolv.conf', '--bind=/dev/loop-control', '--bind=/dev/loop0', '--bind=/dev/loop1', '--bind=/dev/loop2', '--bind=/dev/loop3', '--bind=/dev/loop4', '--bind=/dev/loop5', '--bind=/dev/loop6', '--bind=/dev/loop7', '--bind=/dev/loop8', '--bind=/dev/loop9', '--bind=/dev/loop10', '--bind=/dev/loop11']unshare_net=TrueprintOutput=False) Using nspawn with args ['--capability=cap_ipc_lock', '--bind=/tmp/mock-resolv.srl5clth:/etc/resolv.conf', '--bind=/dev/loop-control', '--bind=/dev/loop0', '--bind=/dev/loop1', '--bind=/dev/loop2', '--bind=/dev/loop3', '--bind=/dev/loop4', '--bind=/dev/loop5', '--bind=/dev/loop6', '--bind=/dev/loop7', '--bind=/dev/loop8', '--bind=/dev/loop9', '--bind=/dev/loop10', '--bind=/dev/loop11'] Executing command: ['/usr/bin/systemd-nspawn', '-q', '-M', 'd271d8fd12f147b9a1b47e1221a12c46', '-D', '/var/lib/mock/dist-an7-build-31545-15745/root', '-a', '-u', 'mockbuild', '--capability=cap_ipc_lock', '--bind=/tmp/mock-resolv.srl5clth:/etc/resolv.conf', '--bind=/dev/loop-control', '--bind=/dev/loop0', '--bind=/dev/loop1', '--bind=/dev/loop2', '--bind=/dev/loop3', '--bind=/dev/loop4', '--bind=/dev/loop5', '--bind=/dev/loop6', '--bind=/dev/loop7', '--bind=/dev/loop8', '--bind=/dev/loop9', '--bind=/dev/loop10', '--bind=/dev/loop11', '--setenv=TERM=vt100', '--setenv=SHELL=/bin/bash', '--setenv=HOME=/builddir', '--setenv=HOSTNAME=mock', '--setenv=PATH=/usr/bin:/bin:/usr/sbin:/sbin', '--setenv=PROMPT_COMMAND=printf "\\033]0;\\007"', '--setenv=PS1= \\s-\\v\\$ ', '--setenv=LANG=C.UTF-8', '--resolv-conf=off', 'bash', '--login', '-c', '/usr/bin/rpmbuild -bs --target noarch --nodeps /builddir/build/SPECS/jboss-annotations-1.1-api.spec'] with env {'TERM': 'vt100', 'SHELL': '/bin/bash', 'HOME': '/builddir', 'HOSTNAME': 'mock', 'PATH': '/usr/bin:/bin:/usr/sbin:/sbin', 'PROMPT_COMMAND': 'printf "\\033]0;\\007"', 'PS1': ' \\s-\\v\\$ ', 'LANG': 'C.UTF-8', 'SYSTEMD_NSPAWN_TMPFS_TMP': '0'} and shell False Building target platforms: noarch Building for target noarch Wrote: /builddir/build/SRPMS/jboss-annotations-1.1-api-1.0.1-0.6.20120212git76e1a2.an7.src.rpm Child return code was: 0 ENTER ['do_with_status'](['bash', '--login', '-c', '/usr/bin/rpmbuild -bb --target noarch --nodeps /builddir/build/SPECS/jboss-annotations-1.1-api.spec'], chrootPath='/var/lib/mock/dist-an7-build-31545-15745/root'env={'TERM': 'vt100', 'SHELL': '/bin/bash', 'HOME': '/builddir', 'HOSTNAME': 'mock', 'PATH': '/usr/bin:/bin:/usr/sbin:/sbin', 'PROMPT_COMMAND': 'printf "\\033]0;\\007"', 'PS1': ' \\s-\\v\\$ ', 'LANG': 'C.UTF-8'}shell=Falselogger=timeout=86400uid=989gid=135user='mockbuild'nspawn_args=['--capability=cap_ipc_lock', '--bind=/tmp/mock-resolv.srl5clth:/etc/resolv.conf', '--bind=/dev/loop-control', '--bind=/dev/loop0', '--bind=/dev/loop1', '--bind=/dev/loop2', '--bind=/dev/loop3', '--bind=/dev/loop4', '--bind=/dev/loop5', '--bind=/dev/loop6', '--bind=/dev/loop7', '--bind=/dev/loop8', '--bind=/dev/loop9', '--bind=/dev/loop10', '--bind=/dev/loop11']unshare_net=TrueprintOutput=False) Using nspawn with args ['--capability=cap_ipc_lock', '--bind=/tmp/mock-resolv.srl5clth:/etc/resolv.conf', '--bind=/dev/loop-control', '--bind=/dev/loop0', '--bind=/dev/loop1', '--bind=/dev/loop2', '--bind=/dev/loop3', '--bind=/dev/loop4', '--bind=/dev/loop5', '--bind=/dev/loop6', '--bind=/dev/loop7', '--bind=/dev/loop8', '--bind=/dev/loop9', '--bind=/dev/loop10', '--bind=/dev/loop11'] Executing command: ['/usr/bin/systemd-nspawn', '-q', '-M', 'fcf24ecf1a9447979697f7985f0815c4', '-D', '/var/lib/mock/dist-an7-build-31545-15745/root', '-a', '-u', 'mockbuild', '--capability=cap_ipc_lock', '--bind=/tmp/mock-resolv.srl5clth:/etc/resolv.conf', '--bind=/dev/loop-control', '--bind=/dev/loop0', '--bind=/dev/loop1', '--bind=/dev/loop2', '--bind=/dev/loop3', '--bind=/dev/loop4', '--bind=/dev/loop5', '--bind=/dev/loop6', '--bind=/dev/loop7', '--bind=/dev/loop8', '--bind=/dev/loop9', '--bind=/dev/loop10', '--bind=/dev/loop11', '--setenv=TERM=vt100', '--setenv=SHELL=/bin/bash', '--setenv=HOME=/builddir', '--setenv=HOSTNAME=mock', '--setenv=PATH=/usr/bin:/bin:/usr/sbin:/sbin', '--setenv=PROMPT_COMMAND=printf "\\033]0;\\007"', '--setenv=PS1= \\s-\\v\\$ ', '--setenv=LANG=C.UTF-8', '--resolv-conf=off', 'bash', '--login', '-c', '/usr/bin/rpmbuild -bb --target noarch --nodeps /builddir/build/SPECS/jboss-annotations-1.1-api.spec'] with env {'TERM': 'vt100', 'SHELL': '/bin/bash', 'HOME': '/builddir', 'HOSTNAME': 'mock', 'PATH': '/usr/bin:/bin:/usr/sbin:/sbin', 'PROMPT_COMMAND': 'printf "\\033]0;\\007"', 'PS1': ' \\s-\\v\\$ ', 'LANG': 'C.UTF-8', 'SYSTEMD_NSPAWN_TMPFS_TMP': '0'} and shell False Building target platforms: noarch Building for target noarch Executing(%prep): /bin/sh -e /var/tmp/rpm-tmp.xOE19F + umask 022 + cd /builddir/build/BUILD + cd /builddir/build/BUILD + rm -rf jboss-annotations-1.1-api-1.0.1 + /usr/bin/xz -dc /builddir/build/SOURCES/jboss-annotations-1.1-api-1.0.1.20120212git76e1a2.tar.xz + /usr/bin/tar -xf - + STATUS=0 + '[' 0 -ne 0 ']' + cd jboss-annotations-1.1-api-1.0.1 + /usr/bin/chmod -Rf a+rX,u+w,g-w,o-w . + exit 0 Executing(%build): /bin/sh -e /var/tmp/rpm-tmp.tVffyb + umask 022 + cd /builddir/build/BUILD + cd jboss-annotations-1.1-api-1.0.1 + mvn-rpmbuild install javadoc:aggregate *************************************************************** * WARNING! mvn-rpmbuild is deprecated and it will be removed * * in future. Users should migrate to using %mvn_build macro * * or call XMvn directly if greater flexibility is required. * *************************************************************** [INFO] Scanning for projects... [WARNING] Failed to resolve artifact: org.apache.maven.plugins:maven-clean-plugin:pom:2.4.1 [WARNING] The POM for org.apache.maven.plugins:maven-clean-plugin:jar:2.4.1 is missing, no dependency information available [WARNING] Failed to retrieve plugin descriptor for org.apache.maven.plugins:maven-clean-plugin:2.4.1: Plugin org.apache.maven.plugins:maven-clean-plugin:2.4.1 or one of its dependencies could not be resolved: Failed to read artifact descriptor for org.apache.maven.plugins:maven-clean-plugin:jar:2.4.1 [WARNING] Failed to resolve artifact: org.apache.maven.plugins:maven-deploy-plugin:pom:2.5 [WARNING] The POM for org.apache.maven.plugins:maven-deploy-plugin:jar:2.5 is missing, no dependency information available [WARNING] Failed to retrieve plugin descriptor for org.apache.maven.plugins:maven-deploy-plugin:2.5: Plugin org.apache.maven.plugins:maven-deploy-plugin:2.5 or one of its dependencies could not be resolved: Failed to read artifact descriptor for org.apache.maven.plugins:maven-deploy-plugin:jar:2.5 [WARNING] Failed to resolve artifact: org.codehaus.mojo:build-helper-maven-plugin:pom:1.5 [WARNING] The POM for org.codehaus.mojo:build-helper-maven-plugin:jar:1.5 is missing, no dependency information available [WARNING] Failed to retrieve plugin descriptor for org.codehaus.mojo:build-helper-maven-plugin:1.5: Plugin org.codehaus.mojo:build-helper-maven-plugin:1.5 or one of its dependencies could not be resolved: Failed to read artifact descriptor for org.codehaus.mojo:build-helper-maven-plugin:jar:1.5 [WARNING] Failed to resolve artifact: org.apache.maven.plugins:maven-checkstyle-plugin:pom:2.5 [WARNING] The POM for org.apache.maven.plugins:maven-checkstyle-plugin:jar:2.5 is missing, no dependency information available [WARNING] Failed to retrieve plugin descriptor for org.apache.maven.plugins:maven-checkstyle-plugin:2.5: Plugin org.apache.maven.plugins:maven-checkstyle-plugin:2.5 or one of its dependencies could not be resolved: Failed to read artifact descriptor for org.apache.maven.plugins:maven-checkstyle-plugin:jar:2.5 [WARNING] Failed to resolve artifact: org.apache.maven.plugins:maven-clean-plugin:pom:2.4.1 [WARNING] The POM for org.apache.maven.plugins:maven-clean-plugin:jar:2.4.1 is missing, no dependency information available [WARNING] Failed to retrieve plugin descriptor for org.apache.maven.plugins:maven-clean-plugin:2.4.1: Plugin org.apache.maven.plugins:maven-clean-plugin:2.4.1 or one of its dependencies could not be resolved: Failed to read artifact descriptor for org.apache.maven.plugins:maven-clean-plugin:jar:2.4.1 [WARNING] Failed to resolve artifact: org.codehaus.mojo:cobertura-maven-plugin:pom:2.4 [WARNING] The POM for org.codehaus.mojo:cobertura-maven-plugin:jar:2.4 is missing, no dependency information available [WARNING] Failed to retrieve plugin descriptor for org.codehaus.mojo:cobertura-maven-plugin:2.4: Plugin org.codehaus.mojo:cobertura-maven-plugin:2.4 or one of its dependencies could not be resolved: Failed to read artifact descriptor for org.codehaus.mojo:cobertura-maven-plugin:jar:2.4 [WARNING] Failed to resolve artifact: org.apache.maven.plugins:maven-dependency-plugin:pom:2.1 [WARNING] The POM for org.apache.maven.plugins:maven-dependency-plugin:jar:2.1 is missing, no dependency information available [WARNING] Failed to retrieve plugin descriptor for org.apache.maven.plugins:maven-dependency-plugin:2.1: Plugin org.apache.maven.plugins:maven-dependency-plugin:2.1 or one of its dependencies could not be resolved: Failed to read artifact descriptor for org.apache.maven.plugins:maven-dependency-plugin:jar:2.1 [WARNING] Failed to resolve artifact: org.apache.maven.plugins:maven-deploy-plugin:pom:2.5 [WARNING] The POM for org.apache.maven.plugins:maven-deploy-plugin:jar:2.5 is missing, no dependency information available [WARNING] Failed to retrieve plugin descriptor for org.apache.maven.plugins:maven-deploy-plugin:2.5: Plugin org.apache.maven.plugins:maven-deploy-plugin:2.5 or one of its dependencies could not be resolved: Failed to read artifact descriptor for org.apache.maven.plugins:maven-deploy-plugin:jar:2.5 [WARNING] Failed to resolve artifact: org.apache.maven.plugins:maven-ear-plugin:pom:2.4.2 [WARNING] The POM for org.apache.maven.plugins:maven-ear-plugin:jar:2.4.2 is missing, no dependency information available [WARNING] Failed to retrieve plugin descriptor for org.apache.maven.plugins:maven-ear-plugin:2.4.2: Plugin org.apache.maven.plugins:maven-ear-plugin:2.4.2 or one of its dependencies could not be resolved: Failed to read artifact descriptor for org.apache.maven.plugins:maven-ear-plugin:jar:2.4.2 [WARNING] Failed to resolve artifact: org.apache.maven.plugins:maven-eclipse-plugin:pom:2.8 [WARNING] The POM for org.apache.maven.plugins:maven-eclipse-plugin:jar:2.8 is missing, no dependency information available [WARNING] Failed to retrieve plugin descriptor for org.apache.maven.plugins:maven-eclipse-plugin:2.8: Plugin org.apache.maven.plugins:maven-eclipse-plugin:2.8 or one of its dependencies could not be resolved: Failed to read artifact descriptor for org.apache.maven.plugins:maven-eclipse-plugin:jar:2.8 [WARNING] Failed to resolve artifact: org.apache.maven.plugins:maven-ejb-plugin:pom:2.2.1 [WARNING] The POM for org.apache.maven.plugins:maven-ejb-plugin:jar:2.2.1 is missing, no dependency information available [WARNING] Failed to retrieve plugin descriptor for org.apache.maven.plugins:maven-ejb-plugin:2.2.1: Plugin org.apache.maven.plugins:maven-ejb-plugin:2.2.1 or one of its dependencies could not be resolved: Failed to read artifact descriptor for org.apache.maven.plugins:maven-ejb-plugin:jar:2.2.1 [WARNING] Failed to resolve artifact: org.apache.maven.plugins:maven-idea-plugin:pom:2.2 [WARNING] The POM for org.apache.maven.plugins:maven-idea-plugin:jar:2.2 is missing, no dependency information available [WARNING] Failed to retrieve plugin descriptor for org.apache.maven.plugins:maven-idea-plugin:2.2: Plugin org.apache.maven.plugins:maven-idea-plugin:2.2 or one of its dependencies could not be resolved: Failed to read artifact descriptor for org.apache.maven.plugins:maven-idea-plugin:jar:2.2 [INFO] [INFO] ------------------------------------------------------------------------ [INFO] Building Common Annotations 1.1 API 1.0.1-SNAPSHOT [INFO] ------------------------------------------------------------------------ [INFO] [INFO] --- maven-enforcer-plugin:1.2:enforce (enforce-java-version) @ jboss-annotations-api_1.1_spec --- [INFO] [INFO] --- maven-enforcer-plugin:1.2:enforce (enforce-maven-version) @ jboss-annotations-api_1.1_spec --- [INFO] [INFO] --- maven-resources-plugin:2.6:resources (default-resources) @ jboss-annotations-api_1.1_spec --- [INFO] Using 'UTF-8' encoding to copy filtered resources. [INFO] skip non existing resourceDirectory /builddir/build/BUILD/jboss-annotations-1.1-api-1.0.1/src/main/resources [INFO] [INFO] --- maven-compiler-plugin:3.1:compile (default-compile) @ jboss-annotations-api_1.1_spec --- [INFO] Changes detected - recompiling the module! [INFO] Compiling 13 source files to /builddir/build/BUILD/jboss-annotations-1.1-api-1.0.1/target/classes [WARNING] bootstrap class path not set in conjunction with -source 1.6 [INFO] [INFO] --- maven-resources-plugin:2.6:testResources (default-testResources) @ jboss-annotations-api_1.1_spec --- [INFO] Using 'UTF-8' encoding to copy filtered resources. [INFO] skip non existing resourceDirectory /builddir/build/BUILD/jboss-annotations-1.1-api-1.0.1/src/test/resources [INFO] [INFO] --- maven-compiler-plugin:3.1:testCompile (default-testCompile) @ jboss-annotations-api_1.1_spec --- [INFO] No sources to compile [INFO] [INFO] --- maven-surefire-plugin:2.15:test (default-test) @ jboss-annotations-api_1.1_spec --- [INFO] No tests to run. [INFO] [INFO] --- maven-jar-plugin:2.4:jar (default-jar) @ jboss-annotations-api_1.1_spec --- [INFO] Building jar: /builddir/build/BUILD/jboss-annotations-1.1-api-1.0.1/target/jboss-annotations-api_1.1_spec-1.0.1-SNAPSHOT.jar [INFO] [INFO] --- maven-source-plugin:2.2.1:jar-no-fork (attach-sources) @ jboss-annotations-api_1.1_spec --- [INFO] Building jar: /builddir/build/BUILD/jboss-annotations-1.1-api-1.0.1/target/jboss-annotations-api_1.1_spec-1.0.1-SNAPSHOT-sources.jar [INFO] [INFO] --- maven-install-plugin:2.4:install (default-install) @ jboss-annotations-api_1.1_spec --- [INFO] Installing /builddir/build/BUILD/jboss-annotations-1.1-api-1.0.1/target/jboss-annotations-api_1.1_spec-1.0.1-SNAPSHOT.jar to /builddir/build/BUILD/jboss-annotations-1.1-api-1.0.1/.m2/org/jboss/spec/javax/annotation/jboss-annotations-api_1.1_spec/1.0.1-SNAPSHOT/jboss-annotations-api_1.1_spec-1.0.1-SNAPSHOT.jar [INFO] Installing /builddir/build/BUILD/jboss-annotations-1.1-api-1.0.1/pom.xml to /builddir/build/BUILD/jboss-annotations-1.1-api-1.0.1/.m2/org/jboss/spec/javax/annotation/jboss-annotations-api_1.1_spec/1.0.1-SNAPSHOT/jboss-annotations-api_1.1_spec-1.0.1-SNAPSHOT.pom [INFO] Installing /builddir/build/BUILD/jboss-annotations-1.1-api-1.0.1/target/jboss-annotations-api_1.1_spec-1.0.1-SNAPSHOT-sources.jar to /builddir/build/BUILD/jboss-annotations-1.1-api-1.0.1/.m2/org/jboss/spec/javax/annotation/jboss-annotations-api_1.1_spec/1.0.1-SNAPSHOT/jboss-annotations-api_1.1_spec-1.0.1-SNAPSHOT-sources.jar [INFO] [INFO] ------------------------------------------------------------------------ [INFO] Building Common Annotations 1.1 API 1.0.1-SNAPSHOT [INFO] ------------------------------------------------------------------------ [WARNING] Failed to resolve artifact: org.apache.maven.plugins:maven-clean-plugin:pom:2.4.1 [WARNING] The POM for org.apache.maven.plugins:maven-clean-plugin:jar:2.4.1 is missing, no dependency information available [WARNING] Failed to retrieve plugin descriptor for org.apache.maven.plugins:maven-clean-plugin:2.4.1: Plugin org.apache.maven.plugins:maven-clean-plugin:2.4.1 or one of its dependencies could not be resolved: Failed to read artifact descriptor for org.apache.maven.plugins:maven-clean-plugin:jar:2.4.1 [WARNING] Failed to resolve artifact: org.apache.maven.plugins:maven-deploy-plugin:pom:2.5 [WARNING] The POM for org.apache.maven.plugins:maven-deploy-plugin:jar:2.5 is missing, no dependency information available [WARNING] Failed to retrieve plugin descriptor for org.apache.maven.plugins:maven-deploy-plugin:2.5: Plugin org.apache.maven.plugins:maven-deploy-plugin:2.5 or one of its dependencies could not be resolved: Failed to read artifact descriptor for org.apache.maven.plugins:maven-deploy-plugin:jar:2.5 [WARNING] Failed to resolve artifact: org.codehaus.mojo:build-helper-maven-plugin:pom:1.5 [WARNING] The POM for org.codehaus.mojo:build-helper-maven-plugin:jar:1.5 is missing, no dependency information available [WARNING] Failed to retrieve plugin descriptor for org.codehaus.mojo:build-helper-maven-plugin:1.5: Plugin org.codehaus.mojo:build-helper-maven-plugin:1.5 or one of its dependencies could not be resolved: Failed to read artifact descriptor for org.codehaus.mojo:build-helper-maven-plugin:jar:1.5 [WARNING] Failed to resolve artifact: org.apache.maven.plugins:maven-checkstyle-plugin:pom:2.5 [WARNING] The POM for org.apache.maven.plugins:maven-checkstyle-plugin:jar:2.5 is missing, no dependency information available [WARNING] Failed to retrieve plugin descriptor for org.apache.maven.plugins:maven-checkstyle-plugin:2.5: Plugin org.apache.maven.plugins:maven-checkstyle-plugin:2.5 or one of its dependencies could not be resolved: Failed to read artifact descriptor for org.apache.maven.plugins:maven-checkstyle-plugin:jar:2.5 [WARNING] Failed to resolve artifact: org.apache.maven.plugins:maven-clean-plugin:pom:2.4.1 [WARNING] The POM for org.apache.maven.plugins:maven-clean-plugin:jar:2.4.1 is missing, no dependency information available [WARNING] Failed to retrieve plugin descriptor for org.apache.maven.plugins:maven-clean-plugin:2.4.1: Plugin org.apache.maven.plugins:maven-clean-plugin:2.4.1 or one of its dependencies could not be resolved: Failed to read artifact descriptor for org.apache.maven.plugins:maven-clean-plugin:jar:2.4.1 [WARNING] Failed to resolve artifact: org.codehaus.mojo:cobertura-maven-plugin:pom:2.4 [WARNING] The POM for org.codehaus.mojo:cobertura-maven-plugin:jar:2.4 is missing, no dependency information available [WARNING] Failed to retrieve plugin descriptor for org.codehaus.mojo:cobertura-maven-plugin:2.4: Plugin org.codehaus.mojo:cobertura-maven-plugin:2.4 or one of its dependencies could not be resolved: Failed to read artifact descriptor for org.codehaus.mojo:cobertura-maven-plugin:jar:2.4 [WARNING] Failed to resolve artifact: org.apache.maven.plugins:maven-dependency-plugin:pom:2.1 [WARNING] The POM for org.apache.maven.plugins:maven-dependency-plugin:jar:2.1 is missing, no dependency information available [WARNING] Failed to retrieve plugin descriptor for org.apache.maven.plugins:maven-dependency-plugin:2.1: Plugin org.apache.maven.plugins:maven-dependency-plugin:2.1 or one of its dependencies could not be resolved: Failed to read artifact descriptor for org.apache.maven.plugins:maven-dependency-plugin:jar:2.1 [WARNING] Failed to resolve artifact: org.apache.maven.plugins:maven-deploy-plugin:pom:2.5 [WARNING] The POM for org.apache.maven.plugins:maven-deploy-plugin:jar:2.5 is missing, no dependency information available [WARNING] Failed to retrieve plugin descriptor for org.apache.maven.plugins:maven-deploy-plugin:2.5: Plugin org.apache.maven.plugins:maven-deploy-plugin:2.5 or one of its dependencies could not be resolved: Failed to read artifact descriptor for org.apache.maven.plugins:maven-deploy-plugin:jar:2.5 [WARNING] Failed to resolve artifact: org.apache.maven.plugins:maven-ear-plugin:pom:2.4.2 [WARNING] The POM for org.apache.maven.plugins:maven-ear-plugin:jar:2.4.2 is missing, no dependency information available [WARNING] Failed to retrieve plugin descriptor for org.apache.maven.plugins:maven-ear-plugin:2.4.2: Plugin org.apache.maven.plugins:maven-ear-plugin:2.4.2 or one of its dependencies could not be resolved: Failed to read artifact descriptor for org.apache.maven.plugins:maven-ear-plugin:jar:2.4.2 [WARNING] Failed to resolve artifact: org.apache.maven.plugins:maven-eclipse-plugin:pom:2.8 [WARNING] The POM for org.apache.maven.plugins:maven-eclipse-plugin:jar:2.8 is missing, no dependency information available [WARNING] Failed to retrieve plugin descriptor for org.apache.maven.plugins:maven-eclipse-plugin:2.8: Plugin org.apache.maven.plugins:maven-eclipse-plugin:2.8 or one of its dependencies could not be resolved: Failed to read artifact descriptor for org.apache.maven.plugins:maven-eclipse-plugin:jar:2.8 [WARNING] Failed to resolve artifact: org.apache.maven.plugins:maven-ejb-plugin:pom:2.2.1 [WARNING] The POM for org.apache.maven.plugins:maven-ejb-plugin:jar:2.2.1 is missing, no dependency information available [WARNING] Failed to retrieve plugin descriptor for org.apache.maven.plugins:maven-ejb-plugin:2.2.1: Plugin org.apache.maven.plugins:maven-ejb-plugin:2.2.1 or one of its dependencies could not be resolved: Failed to read artifact descriptor for org.apache.maven.plugins:maven-ejb-plugin:jar:2.2.1 [WARNING] Failed to resolve artifact: org.apache.maven.plugins:maven-idea-plugin:pom:2.2 [WARNING] The POM for org.apache.maven.plugins:maven-idea-plugin:jar:2.2 is missing, no dependency information available [WARNING] Failed to retrieve plugin descriptor for org.apache.maven.plugins:maven-idea-plugin:2.2: Plugin org.apache.maven.plugins:maven-idea-plugin:2.2 or one of its dependencies could not be resolved: Failed to read artifact descriptor for org.apache.maven.plugins:maven-idea-plugin:jar:2.2 [INFO] [INFO] >>> maven-javadoc-plugin:2.9:aggregate (default-cli) @ jboss-annotations-api_1.1_spec >>> [INFO] [INFO] --- maven-enforcer-plugin:1.2:enforce (enforce-java-version) @ jboss-annotations-api_1.1_spec --- [INFO] [INFO] --- maven-enforcer-plugin:1.2:enforce (enforce-maven-version) @ jboss-annotations-api_1.1_spec --- [INFO] [INFO] <<< maven-javadoc-plugin:2.9:aggregate (default-cli) @ jboss-annotations-api_1.1_spec <<< [INFO] [INFO] --- maven-javadoc-plugin:2.9:aggregate (default-cli) @ jboss-annotations-api_1.1_spec --- [INFO] Loading source files for package javax.annotation... Loading source files for package javax.annotation.security... Loading source files for package javax.annotation.sql... Constructing Javadoc information... Standard Doclet version 1.8.0_242 Building tree for all the packages and classes... Generating /builddir/build/BUILD/jboss-annotations-1.1-api-1.0.1/target/site/apidocs/javax/annotation/Generated.html... Generating /builddir/build/BUILD/jboss-annotations-1.1-api-1.0.1/target/site/apidocs/javax/annotation/ManagedBean.html... Generating /builddir/build/BUILD/jboss-annotations-1.1-api-1.0.1/target/site/apidocs/javax/annotation/PostConstruct.html... Generating /builddir/build/BUILD/jboss-annotations-1.1-api-1.0.1/target/site/apidocs/javax/annotation/PreDestroy.html... Generating /builddir/build/BUILD/jboss-annotations-1.1-api-1.0.1/target/site/apidocs/javax/annotation/Resource.html... Generating /builddir/build/BUILD/jboss-annotations-1.1-api-1.0.1/target/site/apidocs/javax/annotation/Resource.AuthenticationType.html... Generating /builddir/build/BUILD/jboss-annotations-1.1-api-1.0.1/target/site/apidocs/javax/annotation/Resources.html... Generating /builddir/build/BUILD/jboss-annotations-1.1-api-1.0.1/target/site/apidocs/javax/annotation/security/DeclareRoles.html... Generating /builddir/build/BUILD/jboss-annotations-1.1-api-1.0.1/target/site/apidocs/javax/annotation/security/DenyAll.html... Generating /builddir/build/BUILD/jboss-annotations-1.1-api-1.0.1/target/site/apidocs/javax/annotation/security/PermitAll.html... Generating /builddir/build/BUILD/jboss-annotations-1.1-api-1.0.1/target/site/apidocs/javax/annotation/security/RolesAllowed.html... Generating /builddir/build/BUILD/jboss-annotations-1.1-api-1.0.1/target/site/apidocs/javax/annotation/security/RunAs.html... Generating /builddir/build/BUILD/jboss-annotations-1.1-api-1.0.1/target/site/apidocs/javax/annotation/sql/DataSourceDefinition.html... Generating /builddir/build/BUILD/jboss-annotations-1.1-api-1.0.1/target/site/apidocs/javax/annotation/sql/DataSourceDefinitions.html... Generating /builddir/build/BUILD/jboss-annotations-1.1-api-1.0.1/target/site/apidocs/overview-frame.html... Generating /builddir/build/BUILD/jboss-annotations-1.1-api-1.0.1/target/site/apidocs/javax/annotation/package-frame.html... Generating /builddir/build/BUILD/jboss-annotations-1.1-api-1.0.1/target/site/apidocs/javax/annotation/package-summary.html... Generating /builddir/build/BUILD/jboss-annotations-1.1-api-1.0.1/target/site/apidocs/javax/annotation/package-tree.html... Generating /builddir/build/BUILD/jboss-annotations-1.1-api-1.0.1/target/site/apidocs/javax/annotation/security/package-frame.html... Generating /builddir/build/BUILD/jboss-annotations-1.1-api-1.0.1/target/site/apidocs/javax/annotation/security/package-summary.html... Generating /builddir/build/BUILD/jboss-annotations-1.1-api-1.0.1/target/site/apidocs/javax/annotation/security/package-tree.html... Generating /builddir/build/BUILD/jboss-annotations-1.1-api-1.0.1/target/site/apidocs/javax/annotation/sql/package-frame.html... Generating /builddir/build/BUILD/jboss-annotations-1.1-api-1.0.1/target/site/apidocs/javax/annotation/sql/package-summary.html... Generating /builddir/build/BUILD/jboss-annotations-1.1-api-1.0.1/target/site/apidocs/javax/annotation/sql/package-tree.html... Generating /builddir/build/BUILD/jboss-annotations-1.1-api-1.0.1/target/site/apidocs/constant-values.html... Generating /builddir/build/BUILD/jboss-annotations-1.1-api-1.0.1/target/site/apidocs/javax/annotation/class-use/ManagedBean.html... Generating /builddir/build/BUILD/jboss-annotations-1.1-api-1.0.1/target/site/apidocs/javax/annotation/class-use/Resources.html... Generating /builddir/build/BUILD/jboss-annotations-1.1-api-1.0.1/target/site/apidocs/javax/annotation/class-use/Resource.html... Generating /builddir/build/BUILD/jboss-annotations-1.1-api-1.0.1/target/site/apidocs/javax/annotation/class-use/Resource.AuthenticationType.html... Generating /builddir/build/BUILD/jboss-annotations-1.1-api-1.0.1/target/site/apidocs/javax/annotation/class-use/PreDestroy.html... Generating /builddir/build/BUILD/jboss-annotations-1.1-api-1.0.1/target/site/apidocs/javax/annotation/class-use/PostConstruct.html... Generating /builddir/build/BUILD/jboss-annotations-1.1-api-1.0.1/target/site/apidocs/javax/annotation/class-use/Generated.html... Generating /builddir/build/BUILD/jboss-annotations-1.1-api-1.0.1/target/site/apidocs/javax/annotation/security/class-use/RunAs.html... Generating /builddir/build/BUILD/jboss-annotations-1.1-api-1.0.1/target/site/apidocs/javax/annotation/security/class-use/RolesAllowed.html... Generating /builddir/build/BUILD/jboss-annotations-1.1-api-1.0.1/target/site/apidocs/javax/annotation/security/class-use/DenyAll.html... Generating /builddir/build/BUILD/jboss-annotations-1.1-api-1.0.1/target/site/apidocs/javax/annotation/security/class-use/DeclareRoles.html... Generating /builddir/build/BUILD/jboss-annotations-1.1-api-1.0.1/target/site/apidocs/javax/annotation/security/class-use/PermitAll.html... Generating /builddir/build/BUILD/jboss-annotations-1.1-api-1.0.1/target/site/apidocs/javax/annotation/sql/class-use/DataSourceDefinitions.html... Generating /builddir/build/BUILD/jboss-annotations-1.1-api-1.0.1/target/site/apidocs/javax/annotation/sql/class-use/DataSourceDefinition.html... Generating /builddir/build/BUILD/jboss-annotations-1.1-api-1.0.1/target/site/apidocs/javax/annotation/package-use.html... Generating /builddir/build/BUILD/jboss-annotations-1.1-api-1.0.1/target/site/apidocs/javax/annotation/security/package-use.html... Generating /builddir/build/BUILD/jboss-annotations-1.1-api-1.0.1/target/site/apidocs/javax/annotation/sql/package-use.html... Building index for all the packages and classes... Generating /builddir/build/BUILD/jboss-annotations-1.1-api-1.0.1/target/site/apidocs/overview-tree.html... Generating /builddir/build/BUILD/jboss-annotations-1.1-api-1.0.1/target/site/apidocs/index-all.html... Generating /builddir/build/BUILD/jboss-annotations-1.1-api-1.0.1/target/site/apidocs/deprecated-list.html... Building index for all classes... Generating /builddir/build/BUILD/jboss-annotations-1.1-api-1.0.1/target/site/apidocs/allclasses-frame.html... Generating /builddir/build/BUILD/jboss-annotations-1.1-api-1.0.1/target/site/apidocs/allclasses-noframe.html... Generating /builddir/build/BUILD/jboss-annotations-1.1-api-1.0.1/target/site/apidocs/index.html... Generating /builddir/build/BUILD/jboss-annotations-1.1-api-1.0.1/target/site/apidocs/overview-summary.html... Generating /builddir/build/BUILD/jboss-annotations-1.1-api-1.0.1/target/site/apidocs/help-doc.html... 1 error 32 warnings [INFO] ------------------------------------------------------------------------ [INFO] BUILD FAILURE [INFO] ------------------------------------------------------------------------ [INFO] Total time: 1.774s [INFO] Finished at: Thu Aug 26 15:02:04 CST 2021 [INFO] Final Memory: 26M/1490M [INFO] ------------------------------------------------------------------------ [ERROR] Failed to execute goal org.apache.maven.plugins:maven-javadoc-plugin:2.9:aggregate (default-cli) on project jboss-annotations-api_1.1_spec: An error has occurred in JavaDocs report generation: [ERROR] Exit code: 1 - /builddir/build/BUILD/jboss-annotations-1.1-api-1.0.1/src/main/java/javax/annotation/Generated.java:60: warning: no @return [ERROR] String[] value(); [ERROR] ^ [ERROR] /builddir/build/BUILD/jboss-annotations-1.1-api-1.0.1/src/main/java/javax/annotation/Generated.java:71: warning: no @return [ERROR] String comments() default ""; [ERROR] ^ [ERROR] /builddir/build/BUILD/jboss-annotations-1.1-api-1.0.1/src/main/java/javax/annotation/Generated.java:65: warning: no @return [ERROR] String date() default ""; [ERROR] ^ [ERROR] /builddir/build/BUILD/jboss-annotations-1.1-api-1.0.1/src/main/java/javax/annotation/ManagedBean.java:55: warning: no @return [ERROR] public String value() default ""; [ERROR] ^ [ERROR] /builddir/build/BUILD/jboss-annotations-1.1-api-1.0.1/src/main/java/javax/annotation/Resource.java:97: warning: no @return [ERROR] AuthenticationType authenticationType() default AuthenticationType.CONTAINER; [ERROR] ^ [ERROR] /builddir/build/BUILD/jboss-annotations-1.1-api-1.0.1/src/main/java/javax/annotation/Resource.java:131: warning: no @return [ERROR] String description() default ""; [ERROR] ^ [ERROR] /builddir/build/BUILD/jboss-annotations-1.1-api-1.0.1/src/main/java/javax/annotation/Resource.java:72: warning: no @return [ERROR] String lookup() default ""; [ERROR] ^ [ERROR] /builddir/build/BUILD/jboss-annotations-1.1-api-1.0.1/src/main/java/javax/annotation/Resource.java:123: warning: no @return [ERROR] String mappedName() default ""; [ERROR] ^ [ERROR] /builddir/build/BUILD/jboss-annotations-1.1-api-1.0.1/src/main/java/javax/annotation/Resource.java:65: warning: no @return [ERROR] String name() default ""; [ERROR] ^ [ERROR] /builddir/build/BUILD/jboss-annotations-1.1-api-1.0.1/src/main/java/javax/annotation/Resource.java:106: warning: no @return [ERROR] boolean shareable() default true; [ERROR] ^ [ERROR] /builddir/build/BUILD/jboss-annotations-1.1-api-1.0.1/src/main/java/javax/annotation/Resource.java:81: warning: no @return [ERROR] Class type() default java.lang.Object.class; [ERROR] ^ [ERROR] /builddir/build/BUILD/jboss-annotations-1.1-api-1.0.1/src/main/java/javax/annotation/Resources.java:47: warning: no @return [ERROR] Resource[] value(); [ERROR] ^ [ERROR] /builddir/build/BUILD/jboss-annotations-1.1-api-1.0.1/src/main/java/javax/annotation/sql/DataSourceDefinition.java:98: error: reference not found [ERROR] * An example lookup of the {@link DataSource} from an EJB: [ERROR] ^ [ERROR] /builddir/build/BUILD/jboss-annotations-1.1-api-1.0.1/src/main/java/javax/annotation/sql/DataSourceDefinition.java:129: warning: no @return [ERROR] String className(); [ERROR] ^ [ERROR] /builddir/build/BUILD/jboss-annotations-1.1-api-1.0.1/src/main/java/javax/annotation/sql/DataSourceDefinition.java:121: warning: no @return [ERROR] String name(); [ERROR] ^ [ERROR] /builddir/build/BUILD/jboss-annotations-1.1-api-1.0.1/src/main/java/javax/annotation/sql/DataSourceDefinition.java:163: warning: no @return [ERROR] String databaseName() default ""; [ERROR] ^ [ERROR] /builddir/build/BUILD/jboss-annotations-1.1-api-1.0.1/src/main/java/javax/annotation/sql/DataSourceDefinition.java:135: warning: no @return [ERROR] String description() default ""; [ERROR] ^ [ERROR] /builddir/build/BUILD/jboss-annotations-1.1-api-1.0.1/src/main/java/javax/annotation/sql/DataSourceDefinition.java:211: warning: no @return [ERROR] int initialPoolSize() default -1; [ERROR] ^ [ERROR] /builddir/build/BUILD/jboss-annotations-1.1-api-1.0.1/src/main/java/javax/annotation/sql/DataSourceDefinition.java:180: warning: empty

tag [ERROR] *

[ERROR] ^ [ERROR] /builddir/build/BUILD/jboss-annotations-1.1-api-1.0.1/src/main/java/javax/annotation/sql/DataSourceDefinition.java:192: warning: no @return [ERROR] int isolationLevel() default -1; [ERROR] ^ [ERROR] /builddir/build/BUILD/jboss-annotations-1.1-api-1.0.1/src/main/java/javax/annotation/sql/DataSourceDefinition.java:277: warning: no @return [ERROR] int loginTimeout() default 0; [ERROR] ^ [ERROR] /builddir/build/BUILD/jboss-annotations-1.1-api-1.0.1/src/main/java/javax/annotation/sql/DataSourceDefinition.java:239: warning: no @return [ERROR] int maxIdleTime() default -1; [ERROR] ^ [ERROR] /builddir/build/BUILD/jboss-annotations-1.1-api-1.0.1/src/main/java/javax/annotation/sql/DataSourceDefinition.java:220: warning: no @return [ERROR] int maxPoolSize() default -1; [ERROR] ^ [ERROR] /builddir/build/BUILD/jboss-annotations-1.1-api-1.0.1/src/main/java/javax/annotation/sql/DataSourceDefinition.java:249: warning: no @return [ERROR] int maxStatements() default -1; [ERROR] ^ [ERROR] /builddir/build/BUILD/jboss-annotations-1.1-api-1.0.1/src/main/java/javax/annotation/sql/DataSourceDefinition.java:229: warning: no @return [ERROR] int minPoolSize() default -1; [ERROR] ^ [ERROR] /builddir/build/BUILD/jboss-annotations-1.1-api-1.0.1/src/main/java/javax/annotation/sql/DataSourceDefinition.java:157: warning: no @return [ERROR] String password() default ""; [ERROR] ^ [ERROR] /builddir/build/BUILD/jboss-annotations-1.1-api-1.0.1/src/main/java/javax/annotation/sql/DataSourceDefinition.java:169: warning: no @return [ERROR] int portNumber() default -1; [ERROR] ^ [ERROR] /builddir/build/BUILD/jboss-annotations-1.1-api-1.0.1/src/main/java/javax/annotation/sql/DataSourceDefinition.java:253: warning: empty

tag [ERROR] *

[ERROR] ^ [ERROR] /builddir/build/BUILD/jboss-annotations-1.1-api-1.0.1/src/main/java/javax/annotation/sql/DataSourceDefinition.java:265: warning: no @return [ERROR] String[] properties() default {}; [ERROR] ^ [ERROR] /builddir/build/BUILD/jboss-annotations-1.1-api-1.0.1/src/main/java/javax/annotation/sql/DataSourceDefinition.java:175: warning: no @return [ERROR] String serverName() default "localhost"; [ERROR] ^ [ERROR] /builddir/build/BUILD/jboss-annotations-1.1-api-1.0.1/src/main/java/javax/annotation/sql/DataSourceDefinition.java:202: warning: no @return [ERROR] boolean transactional() default true; [ERROR] ^ [ERROR] /builddir/build/BUILD/jboss-annotations-1.1-api-1.0.1/src/main/java/javax/annotation/sql/DataSourceDefinition.java:145: warning: no @return [ERROR] String url() default ""; [ERROR] ^ [ERROR] /builddir/build/BUILD/jboss-annotations-1.1-api-1.0.1/src/main/java/javax/annotation/sql/DataSourceDefinition.java:151: warning: no @return [ERROR] String user() default ""; [ERROR] ^ [ERROR] [ERROR] Command line was: /usr/lib/jvm/java-1.8.0-openjdk-1.8.0.242.b08-0.an7.x86_64/jre/../bin/javadoc @options @packages [ERROR] [ERROR] Refer to the generated Javadoc files in '/builddir/build/BUILD/jboss-annotations-1.1-api-1.0.1/target/site/apidocs' dir. [ERROR] -> [Help 1] [ERROR] [ERROR] To see the full stack trace of the errors, re-run Maven with the -e switch. [ERROR] Re-run Maven using the -X switch to enable full debug logging. [ERROR] [ERROR] For more information about the errors and possible solutions, please read the following articles: [ERROR] [Help 1] http://cwiki.apache.org/confluence/display/MAVEN/MojoExecutionException error: Bad exit status from /var/tmp/rpm-tmp.tVffyb (%build) RPM build errors: Bad exit status from /var/tmp/rpm-tmp.tVffyb (%build) Child return code was: 1 EXCEPTION: [Error()] Traceback (most recent call last): File "/usr/lib/python3.6/site-packages/mockbuild/trace_decorator.py", line 93, in trace result = func(*args, **kw) File "/usr/lib/python3.6/site-packages/mockbuild/util.py", line 600, in do_with_status raise exception.Error("Command failed: \n # %s\n%s" % (command, output), child.returncode) mockbuild.exception.Error: Command failed: # /usr/bin/systemd-nspawn -q -M fcf24ecf1a9447979697f7985f0815c4 -D /var/lib/mock/dist-an7-build-31545-15745/root -a -u mockbuild --capability=cap_ipc_lock --bind=/tmp/mock-resolv.srl5clth:/etc/resolv.conf --bind=/dev/loop-control --bind=/dev/loop0 --bind=/dev/loop1 --bind=/dev/loop2 --bind=/dev/loop3 --bind=/dev/loop4 --bind=/dev/loop5 --bind=/dev/loop6 --bind=/dev/loop7 --bind=/dev/loop8 --bind=/dev/loop9 --bind=/dev/loop10 --bind=/dev/loop11 --setenv=TERM=vt100 --setenv=SHELL=/bin/bash --setenv=HOME=/builddir --setenv=HOSTNAME=mock --setenv=PATH=/usr/bin:/bin:/usr/sbin:/sbin --setenv=PROMPT_COMMAND=printf "\033]0;\007" --setenv=PS1= \s-\v\$ --setenv=LANG=C.UTF-8 --resolv-conf=off bash --login -c /usr/bin/rpmbuild -bb --target noarch --nodeps /builddir/build/SPECS/jboss-annotations-1.1-api.spec